Name,HMS LINCS ID,UniProt ID,Alternative Names,Provider,Provider Catalog ID,Amino Acid Sequence,Gene Symbol,Gene ID,Protein Source,Mutation,Phosphlorylation State,Domain,Protein Description,Protein Purity,Protein Complex,Isoform,Protein Type,Source Organism,Reference,Comments,Date Publicly Available,Most Recent Update
TNF-a,201285,P01375,"Tumor Necrosis Factor-α; TNF-alpha; Tumor Necrosis Factor, TNFSF2, Cachectin, Differentiation-inducing factor (DIF), Necrosin, Cytotoxin",PeproTech,300-01A,VRSSSRTPSD KPVAHVVANP QAEGQLQWLN RRANALLANG VELRDNQLVV PSEGLYLIYS QVLFKGQGCP STHVLLTHTI SRIAVSYQTK VNLLSAIKSP CQRETPEGAE AKPWYEPIYL GGVFQLEKGD RLSAEINRPD YLDFAESGQV YFGIIAL,TNF,7124,recombinantly expressed in E. coli,,,,,>= 98% by SDS-PAGE gel and HPLC analyses,,,cytokine,Homo sapiens,,,,2016-09-14
IL-1 alpha,201286,P01583,Interleukin 1; Hematopoietin-1; Lymphocyte-activating factor (LAF); Endogenous Pyrogen (EP); Leukocyte Endogenous Mediator (LEM); Mononuclear Cell Factor (MCF),PeproTech,200-01A,SAPFSFLSNV KYNFMRIIKY EFILNDALNQ SIIRANDQYL TAAALHNLDE AVKFDMGAYK SSKDDAKITV ILRISKTQLY VTAQDEDQPV LLKEMPEIPK TITGSETNLL FFWETHGTKN YFTSVAHPNL FIATKQDYWV CLAGGPPSIT DFQILENQA,IL1A,,recombinantly expressed in E. coli,,,,,>= 98% by SDS-PAGE gel and HPLC analyses,,,cytokine,Homo sapiens,,,,2016-09-14
IL-6,201287,P05231,"Interleukin 6; 26 kDa protein, IFN-β2, B cell differentiation factor (BCDF), BSF-2, HPGF, HSF, MGI-2",PeproTech,200-06,PVPPGEDSKD VAAPHRQPLT SSERIDKQIR YILDGISALR KETCNKSNMC ESSKEALAEN NLNLPKMAEK DGCFQSGFNE ETCLVKIITG LLEFEVYLEY LQNRFESSEE QARAVQMSTK VLIQFLQKKA KNLDAITTPD PTTNASLLTK LQAQNQWLQD MTTHLILRSF KEFLQSSLRA LRQM,IL6,,recombinantly expressed in E. coli,,,,,>= 98% by SDS-PAGE gel and HPLC analyses,,,cytokine,Homo sapiens,,,,2016-09-14
IL-17A,201288,Q16552,Interleukin-17A  (IL-17A) (IL-17); Cytotoxic T-lymphocyte-associated antigen 8 (CTLA-8),PeproTech,200-17,MIVKAGITIPRNPGCPNSEDKNFPRTVMVNLNIHNRNTNTNPKRSSDYYNRSTSPWNLHRNEDPERYPSVIWEAKCRHLGCINADGNVDYHMNSVPIQQEILVLRREPPHCPNSFRLEKILVSVGCTCVTPIVHHVA,IL17A,,recombinantly expressed in E. coli,,,,,>= 98% by SDS-PAGE gel and HPLC analyses,,,cytokine,Homo sapiens,,,,2016-09-14
EGF,201289,P01133,Epidermal Growth Factor; Urogastrone; URG,PeproTech,AF-100-15,NSDSECPLSH DGYCLHDGVC MYIEALDKYA CNCVVGYIGE RCQYRDLKWW ELR,EGF,,recombinantly expressed in E. coli,,,,,>= 98% by SDS-PAGE gel and HPLC analyses,,,growth factor,Homo sapiens,,,,2016-09-14
IGF-I,201290,P05019,Insulin-like growth factor I; Mechano growth factor; MGF; Somatomedin-C,PeproTech,100-11,GPETLCGAELVDALQFVCGDRGFYFNKPTGYGSSSRRAPQTGIVDECCFRSCDLRRLEMYCAPLKPAKSA,,,E. coli,,,,,greater than 98% by SDS-PAGE gel and HPLC analyses (source: PeproTech),,,,,,,,2017-05-02
Adiponectin,201291,Q15848,"30 kDa adipocyte complement-related protein; Acrp-30; GBP-28; Adipocyte, C1q and collagen domain-containing protein;  Adipose most abundant gene transcript 1 protein; APM-1; Gelatin-binding protein; AdipoQ",PeproTech,450-24,RGHHHHHHHHETTTQGPGVLLPLPKGACTGWMAGIPGHPGHNGAPGRDGRDGTPGEKGEKGDPGLIGPKGDIGETGVPGAEGPRGFPGIQGRKGEPGEGAYVYRSAFSVGLETYVTIPNMPIRFTKIFYNQQNHYDGSTGKFHCNIPGLYYFAYHITVYMKDVKVSLFKKDKAMLFTYDQYQENNVDQASGSVLLHLEVGDQVWLQVYGEGERNGLYADNDNDSTFTGFLLYHDTN,ADIPOQ,,recombinantly expressed in Hi-5 insect cells,,,,,>97% by SDS-PAGE gel and HPLC analyses,,,,Homo sapiens,,,,2016-09-14
Leptin,201292,P41159,Obese protein (OB); Obesity factor,PeproTech,300-27,MVPIQKVQDDTKTLIKTIVTRINDISHTQSVSSKQKVTGLDFIPGLHPILTLSKMDQTLAVYQQILTSMPSRNVIQISNDLENLRDLLHVLAFSKSCHLPWASGLETLDSLGGVLEASGYSTEVVALSRLQGSLQDMLWQLDLSPGC,LEP,,recombinantly expressed in E. coli,,,,,>98% by SDS-PAGE gel and HPLC analyses,,,cytokine,Homo sapiens,,,,2016-09-14
Visfatin,201293,P43490,Nicotinamide phosphoribosyltransferase (NAmPRTase) (Nampt); Pre-B-cell colony-enhancing factor 1; Pre-B cell-enhancing factor; PBEF: Visfatin,PeproTech,130-09,MPPNTSKVYSYFECREKKTENSKLRKVKYEETVFYGLQYILNKYLKGKVVTKEKIQEAKDVYKEHFQDDVFNEKGWNYILEKYDGHLPIEIKAVPEGFVIPRGNVLFTVENTDPECYWLTNWIETILVQSWYPITVATNSREQKKILAKYLLETSGNLDGLEYKLHDFGYRGVSSQETAGIGASAHLVNFKGTDTVAGLALIKKYYGTKDPVPGYSVPAAEHSTITAWGKDHEKDAFEHIVTQFSSVPVSVVSDSYDIYNACEKIWGEDLRHLIVSRSTQAPLIIRPDSGNPLDTVLKVLEILGKKFPVTENSKGYKLLPPYLRVIQGDGVDINTLQEIVEGMKQKMWSIENIAFGSGGGLLQKLTRDLLNCSFKCSYVVTNGLGINVFKDPVADPNKRSKKGRLSLHRTPAGNFVTLEEGKGDLEEYGQDLLHTVFKNGKVTKSYSFDEIRKNAQLNIELEAAHH,NAMPT,,recombinantly expressed in E. coli,,,,,>98% by SDS-PAGE gel and HPLC analyses,,,,Homo sapiens,,,,2016-09-14
