Name,HMS LINCS ID,UniProt ID,Alternative Names,Provider,Provider Catalog ID,Amino Acid Sequence,Gene Symbol,Gene ID,Protein Source,Mutation,Phosphlorylation State,Domain,Protein Description,Protein Purity,Protein Complex,Isoform,Protein Type,Source Organism,Reference,Comments,Date Publicly Available,Most Recent Update
AAK1,200001,Q2M2I8,AP2 associated kinase 1; AAK1; DKFZp686F03202; DKFZp686K16132; FLJ23712; FLJ25931; FLJ31060; FLJ42882; FLJ45252; KIAA1048; MGC138170; MGC164568; MGC164570,KINOMEscan,,,AAK1,22848,Bacterial expression system,,,,Wild Type; Partial length,,,,,Homo sapiens,,,2012-11-15,2016-09-14
ABL1,200002,P00519,"C-abl oncogene 1, receptor tyrosine kinase; ABL; ABL1; bcr/abl; c-ABL; JTK7; p150; v-abl",KINOMEscan,,,ABL1,25,,,,,,,,,,Homo sapiens,,,2012-11-15,2016-09-14
ABL1(E255K),200003,P00519,"C-abl oncogene 1, receptor tyrosine kinase; ABL; ABL1; bcr/abl; c-ABL; JTK7; p150; v-abl",KINOMEscan,,,ABL1,25,,E255K,,,,,,,,Homo sapiens,,,2012-11-15,2016-09-14
ABL1(E255K)-phosphorylated,200004,P00519,"C-abl oncogene 1, receptor tyrosine kinase; ABL; ABL1; bcr/abl; c-ABL; JTK7; p150; v-abl",KINOMEscan,,,ABL1,25,Mammalian expression system,E255K,phosphorylated,,Mutation (E255K); Partial length,,,,,Homo sapiens,,,2012-11-15,2014-02-07
ABL1(F317I),200005,P00519,"C-abl oncogene 1, receptor tyrosine kinase; ABL; ABL1; bcr/abl; c-ABL; JTK7; p150; v-abl",KINOMEscan,,,ABL1,25,,F317I,,,,,,,,Homo sapiens,,,2012-11-15,2016-09-14
ABL1(F317I)-nonphosphorylated,200006,P00519,"C-abl oncogene 1, receptor tyrosine kinase; ABL; ABL1; bcr/abl; c-ABL; JTK7; p150; v-abl",KINOMEscan,,,ABL1,25,Mammalian expression system,F317I,nonphosphorylated,,Mutation (F317I); Partial length,,,,,Homo sapiens,,,2012-11-15,2014-02-07
ABL1(F317I)-phosphorylated,200007,P00519,"C-abl oncogene 1, receptor tyrosine kinase; ABL; ABL1; bcr/abl; c-ABL; JTK7; p150; v-abl",KINOMEscan,,,ABL1,25,Mammalian expression system,F317I,phosphorylated,,Mutation (F317I); Partial length,,,,,Homo sapiens,,,2012-11-15,2014-02-07
ABL1(F317L),200008,P00519,"C-abl oncogene 1, receptor tyrosine kinase; ABL; ABL1; bcr/abl; c-ABL; JTK7; p150; v-abl",KINOMEscan,,,ABL1,25,,F317L,,,,,,,,Homo sapiens,,,2012-11-15,2016-09-14
ABL1(F317L)-nonphosphorylated,200009,P00519,"C-abl oncogene 1, receptor tyrosine kinase; ABL; ABL1; bcr/abl; c-ABL; JTK7; p150; v-abl",KINOMEscan,,,ABL1,25,Mammalian expression system,F317L,nonphosphorylated,,Mutation (F317L); Partial length,,,,,Homo sapiens,,,2012-11-15,2014-02-07
ABL1(F317L)-phosphorylated,200010,P00519,"C-abl oncogene 1, receptor tyrosine kinase; ABL; ABL1; bcr/abl; c-ABL; JTK7; p150; v-abl",KINOMEscan,,,ABL1,25,Mammalian expression system,F317L,phosphorylated,,Mutation (F317L); Partial length,,,,,Homo sapiens,,,2012-11-15,2014-02-07
ABL1(H396P),200011,P00519,"C-abl oncogene 1, receptor tyrosine kinase; ABL; ABL1; bcr/abl; c-ABL; JTK7; p150; v-abl",KINOMEscan,,,ABL1,25,,H396P,,,,,,,,Homo sapiens,,,2012-11-15,2016-09-14
ABL1(H396P)-nonphosphorylated,200012,P00519,"C-abl oncogene 1, receptor tyrosine kinase; ABL; ABL1; bcr/abl; c-ABL; JTK7; p150; v-abl",KINOMEscan,,,ABL1,25,Mammalian expression system,H396P,nonphosphorylated,,Mutation (H396P); Partial length,,,,,Homo sapiens,,,2012-11-15,2014-02-07
ABL1(H396P)-phosphorylated,200013,P00519,"C-abl oncogene 1, receptor tyrosine kinase; ABL; ABL1; bcr/abl; c-ABL; JTK7; p150; v-abl",KINOMEscan,,,ABL1,25,Mammalian expression system,H396P,phosphorylated,,Mutation (H396P); Partial length,,,,,Homo sapiens,,,2012-11-15,2014-02-07
ABL1(M351T),200014,P00519,"C-abl oncogene 1, receptor tyrosine kinase; ABL; ABL1; bcr/abl; c-ABL; JTK7; p150; v-abl",KINOMEscan,,,ABL1,25,,M351T,,,,,,,,Homo sapiens,,,2012-11-15,2016-09-14
ABL1(M351T)-phosphorylated,200015,P00519,"C-abl oncogene 1, receptor tyrosine kinase; ABL; ABL1; bcr/abl; c-ABL; JTK7; p150; v-abl",KINOMEscan,,,ABL1,25,Mammalian expression system,M351T,phosphorylated,,Mutation (M351T); Partial length,,,,,Homo sapiens,,,2012-11-15,2014-02-07
ABL1(Q252H),200016,P00519,"C-abl oncogene 1, receptor tyrosine kinase; ABL; ABL1; bcr/abl; c-ABL; JTK7; p150; v-abl",KINOMEscan,,,ABL1,25,,Q252H,,,,,,,,Homo sapiens,,,2012-11-15,2016-09-14
ABL1(Q252H)-nonphosphorylated,200017,P00519,"C-abl oncogene 1, receptor tyrosine kinase; ABL; ABL1; bcr/abl; c-ABL; JTK7; p150; v-abl",KINOMEscan,,,ABL1,25,Mammalian expression system,Q252H,nonphosphorylated,,Mutation (Q252H); Partial length,,,,,Homo sapiens,,,2012-11-15,2014-02-07
ABL1(Q252H)-phosphorylated,200018,P00519,"C-abl oncogene 1, receptor tyrosine kinase; ABL; ABL1; bcr/abl; c-ABL; JTK7; p150; v-abl",KINOMEscan,,,ABL1,25,Mammalian expression system,Q252H,phosphorylated,,Mutation (Q252H); Partial length,,,,,Homo sapiens,,,2012-11-15,2014-02-07
ABL1(T315I),200019,P00519,"C-abl oncogene 1, receptor tyrosine kinase; ABL; ABL1; bcr/abl; c-ABL; JTK7; p150; v-abl",KINOMEscan,,,ABL1,25,,T315I,,,,,,,,Homo sapiens,,,2012-11-15,2016-09-14
ABL1(T315I)-nonphosphorylated,200020,P00519,"C-abl oncogene 1, receptor tyrosine kinase; ABL; ABL1; bcr/abl; c-ABL; JTK7; p150; v-abl",KINOMEscan,,,ABL1,25,Mammalian expression system,T315I,nonphosphorylated,,Mutation (T315I); Partial length,,,,,Homo sapiens,,,2012-11-15,2014-02-07
ABL1(T315I)-phosphorylated,200021,P00519,"C-abl oncogene 1, receptor tyrosine kinase; ABL; ABL1; bcr/abl; c-ABL; JTK7; p150; v-abl",KINOMEscan,,,ABL1,25,Mammalian expression system,T315I,phosphorylated,,Mutation (T315I); Partial length,,,,,Homo sapiens,,,2012-11-15,2014-02-07
ABL1(Y253F),200022,P00519,"C-abl oncogene 1, receptor tyrosine kinase; ABL; ABL1; bcr/abl; c-ABL; JTK7; p150; v-abl",KINOMEscan,,,ABL1,25,,Y253F,,,,,,,,Homo sapiens,,,2012-11-15,2016-09-14
ABL1(Y253F)-phosphorylated,200023,P00519,"C-abl oncogene 1, receptor tyrosine kinase; ABL; ABL1; bcr/abl; c-ABL; JTK7; p150; v-abl",KINOMEscan,,,ABL1,25,Mammalian expression system,Y253F,phosphorylated,,Mutation (Y253F); Partial length,,,,,Homo sapiens,,,2012-11-15,2014-02-07
ABL1-nonphosphorylated,200024,P00519,"C-abl oncogene 1, receptor tyrosine kinase; ABL; ABL1; bcr/abl; c-ABL; JTK7; p150; v-abl",KINOMEscan,,,ABL1,25,Mammalian expression system,,nonphosphorylated,,Wild Type; Partial length,,,,,Homo sapiens,,,2012-11-15,2016-09-14
ABL1-phosphorylated,200025,P00519,"C-abl oncogene 1, receptor tyrosine kinase; ABL; ABL1; bcr/abl; c-ABL; JTK7; p150; v-abl",KINOMEscan,,,ABL1,25,Mammalian expression system,,phosphorylated,,Wild Type; Partial length,,,,,Homo sapiens,,,2012-11-15,2016-09-14
ABL2,200026,P42684,"V-abl Abelson murine leukemia viral oncogene homolog 2 (arg, Abelson-related gene); ABL2; ABLL; ARG; FLJ22224; FLJ31718; FLJ41441",KINOMEscan,,,ABL2,27,Bacterial expression system,,,,Wild Type; Partial length,,,,,Homo sapiens,,,2012-11-15,2016-09-14
ACVR1,200027,Q04771,"Activin A receptor, type I; ACTRI; ACVR1; ACVR1A; ACVRLK2; ALK2; FOP; SKR1; TSRI",KINOMEscan,,,ACVR1,90,Bacterial expression system,,,,Wild Type; Partial length,,,,,Homo sapiens,,,2012-11-15,2016-09-14
ACVR1B,200028,P36896,"Activin A receptor, type IB; ACTRIB; ACVR1B; ACVRLK4; ALK4; SKR2",KINOMEscan,,,ACVR1B,91,Bacterial expression system,,,,Wild Type; Partial length,,,,,Homo sapiens,,,2012-11-15,2016-09-14
ACVR2A,200029,P27037,"Activin A receptor, type IIA; ActR2; ACTRII; ACVR2; ACVR2A",KINOMEscan,,,ACVR2A,92,Bacterial expression system,,,,Wild Type; Partial length,,,,,Homo sapiens,,,2012-11-15,2016-09-14
ACVR2B,200030,Q13705,"Activin A receptor, type IIB; ActR2B; ACTRIIB; ActR-IIB; ACVR2B; MGC116908",KINOMEscan,,,ACVR2B,93,Bacterial expression system,,,,Wild Type; Partial length,,,,,Homo sapiens,,,2012-11-15,2016-09-14
ACVRL1,200031,P37023,Activin A receptor type II-like 1; ACVRL1; ACVRLK1; ALK1; ALK-1; HHT; HHT2; ORW2; SKR3; TSR-I,KINOMEscan,,,ACVRL1,94,Bacterial expression system,,,,Wild Type; Partial length,,,,,Homo sapiens,,,2012-11-15,2016-09-14
ADCK3,200032,Q8NI60,"Chaperone, ABC1 activity of bc1 complex homolog (S. pombe); ADCK3; ARCA2; CABC1; COQ8; MGC4849; SCAR9",KINOMEscan,,,CABC1,56997,Bacterial expression system,,,,Wild Type; Full length,,,,,Homo sapiens,,,2012-11-15,2016-09-14
ADCK4,200033,Q96D53,AarF domain containing kinase 4; ADCK4; FLJ12229,KINOMEscan,,,ADCK4,79934,Bacterial expression system,,,,Wild Type; Full length,,,,,Homo sapiens,,,2012-11-15,2016-09-14
AKT1,200034,P31749,V-akt murine thymoma viral oncogene homolog 1; AKT; AKT1; Akt1/PKBa; MGC99656; PKB; PKBa; PKB-ALPHA; PRKBA; RAC; RAC-ALPHA,KINOMEscan,,,AKT1,207,Bacterial expression system,,,,Wild Type; Partial length,,,,,Homo sapiens,,,2012-11-15,2016-09-14
AKT2,200035,P31751,V-akt murine thymoma viral oncogene homolog 2; AKT2; Akt2/PKBb; PKBb; PKBBETA; PRKBB; RAC-BETA,KINOMEscan,,,AKT2,208,Bacterial expression system,,,,Wild Type; Partial length,,,,,Homo sapiens,,,2012-11-15,2016-09-14
AKT3,200036,Q9Y243,"V-akt murine thymoma viral oncogene homolog 3 (protein kinase B, gamma); AKT3; Akt3/PKBg; DKFZp434N0250; PKBg; PKB-GAMMA; PRKBG; RAC-gamma; RAC-PK-gamma; STK-2",KINOMEscan,,,AKT3,10000,Bacterial expression system,,,,Wild Type; Partial length,,,,,Homo sapiens,,,2012-11-15,2016-09-14
ALK,200037,Q9UM73,Anaplastic lymphoma receptor tyrosine kinase; ALK; CD246; NBLST3; TFG/ALK,KINOMEscan,,,ALK,238,Bacterial expression system,,,,Wild Type; Partial length,,,,,Homo sapiens,,,2012-11-15,2016-09-14
AMPK-alpha1,200038,Q13131,"Protein kinase, AMP-activated, alpha 2 catalytic subunit; AMPK; AMPKa1; AMPK-alpha1; MGC33776; MGC57364; PRKAA1",KINOMEscan,,,PRKAA1,5562,Bacterial expression system,,,,Wild Type; Partial length,,,,,Homo sapiens,,,2012-11-15,2016-09-14
AMPK-alpha2,200039,P54646,"Protein kinase, AMP-activated, alpha 2 catalytic subunit; AMPK; AMPK2; AMPKa2; AMPK-alpha2; PRKAA; PRKAA2",KINOMEscan,,,PRKAA2,5563,Bacterial expression system,,,,Wild Type; Partial length,,,,,Homo sapiens,,,2012-11-15,2016-09-14
ANKK1,200040,Q8NFD2,Ankyrin repeat and kinase domain containing 1; ANKK1; PKK2; SgK288,KINOMEscan,,,ANKK1,255239,Mammalian expression system,,,,Wild Type; Partial length,,,,,Homo sapiens,,,2012-11-15,2016-09-14
NUAK1,200041,O60285,"NUAK family, SNF1-like kinase, 1; ARK5; KIAA0537; NUAK1",KINOMEscan,,,NUAK1,9891,Bacterial expression system,,,,Wild Type; Partial length,,,,,Homo sapiens,,,2012-11-15,2016-09-14
M3K5,200042,Q99683,Mitogen-activated protein kinase kinase kinase 5; ASK; ASK/MAP3K5; ASK1; MAP3K5; MAPKKK5; MEKK5,KINOMEscan,,,MAP3K5,4217,Bacterial expression system,,,,Wild Type; Partial length,,,,,Homo sapiens,,,2012-11-15,2016-09-14
M3K6,200043,O95382,Mitogen-activated protein kinase kinase kinase 6; ASK2; MAP3K6; MAPKKK6; MEKK6; MEKK6/MAP3K6; MGC125653; MGC20114,KINOMEscan,,,MAP3K6,9064,Mammalian expression system,,,,Wild Type; Partial length,,,,,Homo sapiens,,,2012-11-15,2016-09-14
AURKA,200044,O14965,Aurora kinase A; AIK; AIRK1; ARK1; Aur2; AURA; AurA/Aur2; AURKA; AURORA2; Aurora-A; Ayk1; BTAK; IAK; IAK1; MGC34538; STK15; STK6; STK7,KINOMEscan,,,AURKA,6790,Mammalian expression system,,,,Wild Type; Partial length,,,,,Homo sapiens,,,2012-11-15,2016-09-14
AURKB,200045,Q96GD4,Aurora kinase B; AIK2; AIM1; AIM-1; ARK2; Aur1; AurB; AurB/Aur1; AURKB; aurkb-sv1; aurkb-sv2; IPL1; STK12; STK5,KINOMEscan,,,AURKB,9212,Mammalian expression system,,,,Wild Type; Partial length,,,,,Homo sapiens,,,2012-11-15,2016-09-14
AURKC,200046,Q9UQB9,Aurora kinase C; AIE2; AIK3; ARK3; Aur3; AurC; AurC/Aur3; AURKC; aurora-C; STK13,KINOMEscan,,,AURKC,6795,Bacterial expression system,,,,Wild Type; Full length,,,,,Homo sapiens,,,2012-11-15,2016-09-14
AXL,200047,P30530,AXL receptor tyrosine kinase; AXL; JTK11; UFO,KINOMEscan,,,AXL,558,Bacterial expression system,,,,Wild Type; Partial length,,,,,Homo sapiens,,,2012-11-15,2016-09-14
BIKE,200048,Q9NSY1,BMP2 inducible kinase; BIKE; BMP2K; DKFZp434K0614; DKFZp434P0116; HRIHFB2017,KINOMEscan,,,BMP2K,55589,Bacterial expression system,,,,Wild Type; Partial length,,,,,Homo sapiens,,,2012-11-15,2016-09-14
BLK,200049,P51451,Tyrosine-protein kinase BLK; B lymphoid tyrosine kinase; BLK; MGC10442,KINOMEscan,,,BLK,640,Bacterial expression system,,,,Wild Type; Partial length,,,,,Homo sapiens,,,2012-11-15,2016-09-14
BMPR1A,200050,P36894,"Bone morphogenetic protein receptor, type IA; 10q23del; ACVRLK3; ALK3; BMPR1A; CD292; SKR5",KINOMEscan,,,BMPR1A,657,Bacterial expression system,,,,Wild Type; Partial length,,,,,Homo sapiens,,,2012-11-15,2016-09-14
BMPR1B,200051,O00238,"Bone morphogenetic protein receptor, type IB; ALK6; ALK-6; BMPR1B; CDw293",KINOMEscan,,,BMPR1B,658,Mammalian expression system,,,,Wild Type; Partial length,,,,,Homo sapiens,,,2012-11-15,2016-09-14
BMPR2,200052,Q13873,"Bone morphogenetic protein receptor, type II (serine/threonine kinase); BMPR2; BMPR3; BMPR-II; BMR2; BRK-3; FLJ41585; FLJ76945; PPH1; T-ALK",KINOMEscan,,,BMPR2,659,Mammalian expression system,,,,Wild Type; Partial length,,,,,Homo sapiens,,,2012-11-15,2016-09-14
BMX,200053,P51813,BMX non-receptor tyrosine kinase; BMX; ETK; Etk/BMX; PSCTK2; PSCTK3,KINOMEscan,,,BMX,660,Bacterial expression system,,,,Wild Type; Full length,,,,,Homo sapiens,,,2012-11-15,2016-09-14
BRAF,200054,P15056,Serine/threonine-protein kinase B-raf; v-raf murine sarcoma viral oncogene homolog B1; BRAF1; RAFB1,KINOMEscan,,,BRAF,673,Mammalian expression system,,,,Wild Type; Partial length,,,,,Homo sapiens,,,2012-11-15,2016-09-14
BRAF(V600E),200055,P15056,V-raf murine sarcoma viral oncogene homolog B1; BRAF; BRAF1; B-RAF1; FLJ95109; MGC126806; MGC138284; RAFB1,KINOMEscan,,,BRAF,673,Mammalian expression system,V600E,,,Mutation (V600E); Partial length,,,,,Homo sapiens,,,2012-11-15,2016-09-14
PTK6,200056,Q13882,Protein tyrosine kinase 6; BRK; FLJ42088; PTK6,KINOMEscan,,,PTK6,5753,Bacterial expression system,,,,Wild Type; Partial length,,,,,Homo sapiens,,,2012-11-15,2016-09-14
BRSK1,200057,Q8TDC3,BR serine/threonine kinase 1; BRSK1; FLJ43009; KIAA1811,KINOMEscan,,,BRSK1,84446,Bacterial expression system,,,,Wild Type; Partial length,,,,,Homo sapiens,,,2012-11-15,2016-09-14
BRSK2,200058,Q8IWQ3,BR serine/threonine kinase 2; BRSK2; C11orf7; FLJ41362; PEN11B; SAD1; STK29,KINOMEscan,,,BRSK2,9024,Bacterial expression system,,,,Wild Type; Full length,,,,,Homo sapiens,,,2012-11-15,2016-09-14
BTK,200059,Q06187,Tyrosine-protein kinase BTK; agammaglobulinemia tyrosine kinase; AGMX1; ATK; BPK,KINOMEscan,,,BTK,695,Mammalian expression system,,,,Wild Type; Full length,,,,,Homo sapiens,,,2012-11-15,2016-09-14
CAMK1,200060,Q14012,Calcium/calmodulin-dependent protein kinase I; CAMK1; CaMK1a; CAMKI; MGC120317; MGC120318,KINOMEscan,,,CAMK1,8536,Bacterial expression system,,,,Wild Type; Full length,,,,,Homo sapiens,,,2012-11-15,2016-09-14
CAMK1D,200061,Q8IU85,Calcium/calmodulin-dependent protein kinase ID; CaM-K1; CAMK1D; CaMKID; CKLiK,KINOMEscan,,,CAMK1D,57118,Bacterial expression system,,,,Wild Type; Partial length,,,,,Homo sapiens,,,2012-11-15,2016-09-14
CAMK1G,200062,Q96NX5,Calcium/calmodulin-dependent protein kinase IG; CAMK1G; CLICKIII; dJ272L16.1; VWS1,KINOMEscan,,,CAMK1G,57172,Bacterial expression system,,,,Wild Type; Partial length,,,,,Homo sapiens,,,2012-11-15,2016-09-14
CAMK2A,200063,Q9UQM7,Calcium/calmodulin-dependent protein kinase II alpha; CAMK2A; CAMKA; KIAA0968,KINOMEscan,,,CAMK2A,815,Bacterial expression system,,,,Wild Type; Partial length,,,,,Homo sapiens,,,2012-11-15,2016-09-14
CAMK2B,200064,Q13554,Calcium/calmodulin-dependent protein kinase II beta; CAM2; CAMK2; CAMK2B; CAMKB; MGC29528,KINOMEscan,,,CAMK2B,816,Bacterial expression system,,,,Wild Type; Partial length,,,,,Homo sapiens,,,2012-11-15,2016-09-14
KCC2D,200065,Q13557,Calcium/calmodulin-dependent protein kinase type II subunit delta; CaM kinase II subunit delta; CAMK2D; CAMKD; DKFZp686G23119; DKFZp686I2288; MGC44911,KINOMEscan,,,CAMK2D,817,Bacterial expression system,,,,Wild Type; Partial length,,,,,Homo sapiens,,,2012-11-15,2016-09-14
CAMK2G,200066,Q13555,Calcium/calmodulin-dependent protein kinase II gamma; CAMK; CAMK2G; CAMKG; CAMK-II; FLJ16043; MGC26678,KINOMEscan,,,CAMK2G,818,Bacterial expression system,,,,Wild Type; Partial length,,,,,Homo sapiens,,,2012-11-15,2016-09-14
KCC4,200067,Q16566,Calcium/calmodulin-dependent protein kinase type IV; CAMK4; CaMK-GR; MGC36771,KINOMEscan,,,CAMK4,814,Bacterial expression system,,,,Wild Type; Partial length,,,,,Homo sapiens,,,2012-11-15,2016-09-14
KKCC1,200068,Q8N5S9,"Calcium/calmodulin-dependent protein kinase kinase 1, CaM-kinase IV kinase; CAMKK1; CAMKKA; DKFZp761M0423; MGC34095",KINOMEscan,,,CAMKK1,84254,Bacterial expression system,,,,Wild Type; Partial length,,,,,Homo sapiens,,,2012-11-15,2016-09-14
CAMKK2,200069,Q96RR4,"Calcium/calmodulin-dependent protein kinase kinase 2, beta; CAMKK; CAMKK2; CAMKKB; KIAA0787; MGC15254",KINOMEscan,,,CAMKK2,10645,Bacterial expression system,,,,Wild Type; Partial length,,,,,Homo sapiens,,,2012-11-15,2016-09-14
CASK,200070,O14936,Calcium/calmodulin-dependent serine protein kinase (MAGUK family); CAGH39; CAMGUK; CASK; CMG; FGS4; FLJ22219; FLJ31914; LIN2; MICPCH; TNRC8,KINOMEscan,,,CASK,8573,Mammalian expression system,,,,Wild Type; Partial length,,,,,Homo sapiens,,,2012-11-15,2016-09-14
CDC2L1,200071,P21127,Cyclin-dependent kinase 11B; CDC2L1; CDC2L2; CDK11; CDK11B; CDK11-p110; CDK11-p46; CDK11-p58; CLK-1; FLJ59152; p58; p58CDC2L1; p58CLK-1; PITSLRE; PK58,KINOMEscan,,,CDK11B,984,Bacterial expression system,,,,Wild Type; Partial length,,,,,Homo sapiens,,,2012-11-15,2016-09-14
CDC2L2,200072,Q9UQ88,Cyclin-dependent kinase 11A; CDC2L2; CDC2L3; CDK11A; CDK11-p110; CDK11-p46; CDK11-p58; MGC131975; p58GTA; PITSLRE,KINOMEscan,,,CDC2L2,985,Bacterial expression system,,,,Wild Type; Partial length,,,,,Homo sapiens,,,2012-11-15,2016-09-14
CDC2L5,200073,Q14004,Cyclin-dependent kinase 13; CDC2L; CDC2L5; CDK13; CHED; FLJ35215; KIAA1791,KINOMEscan,,,CDK13,8621,Mammalian expression system,,,,Wild Type; Partial length,,,,,Homo sapiens,,,2012-11-15,2016-09-14
CDK11,200074,Q9BWU1,Cyclin-dependent kinase 19; bA346C16.3; CDC2L6; CDK11; CDK19; KIAA1028,KINOMEscan,,,CDK19,23097,Bacterial expression system,,,,Wild Type; Partial length,,,,,Homo sapiens,,,2012-11-15,2016-09-14
CDK2,200075,P24941,Cyclin-dependent kinase 2; p33 protein kinase,KINOMEscan,,,CDK2,1017,Bacterial expression system,,,,Wild Type; Full length,,,,,Homo sapiens,,,2012-11-15,2016-09-14
CDK3,200076,Q00526,Cyclin-dependent kinase 3; CDK3,KINOMEscan,,,CDK3,1018,Bacterial expression system,,,,Wild Type; Full length,,,,,Homo sapiens,,,2012-11-15,2016-09-14
CDK4-cyclinD1,200077,P11802,Cyclin-dependent kinase 4; cell division protein kinase 4,KINOMEscan,,,CDK4,1019,Mammalian expression system,,,,Wild Type; Full length,,,,,Homo sapiens,,,2012-11-15,2016-09-14
CDK4-cyclinD3,200078,P11802,Cyclin-dependent kinase 4; cell division protein kinase 4,KINOMEscan,,,CDK4,1019,Mammalian expression system,,,,Wild Type; Full length,,,,,Homo sapiens,,,2012-11-15,2016-09-14
CDK5,200079,Q00535,Cyclin-dependent kinase 5; cell division protein kinase 5; PSSALRE,KINOMEscan,,,CDK5,1020,Bacterial expression system,,,,Wild Type; Full length,,,,,Homo sapiens,,,2012-11-15,2016-09-14
CDK7,200080,P50613,Cyclin-dependent kinase 7; cell division protein kinase 7; CAK1; CDK7; CDKN7; MO15; p39MO15; STK1,KINOMEscan,,,CDK7,1022,Mammalian expression system,,,,Wild Type; Full length,,,,,Homo sapiens,,,2012-11-15,2016-09-14
CDK8,200081,P49336,Cyclin-dependent kinase 8; cell division protein kinase 8; CDK8; K35; MGC126074; MGC126075,KINOMEscan,,,CDK8,1024,Bacterial expression system,,,,Wild Type; Partial length,,,,,Homo sapiens,,,2012-11-15,2016-09-14
CDK9,200082,P50750,Cyclin-dependent kinase 9; cell division protein kinase 9; C-2k; CDC2L4; CDK9; CTK1; PITALRE; TAK,KINOMEscan,,,CDK9,1025,Bacterial expression system,,,,Wild Type; Full length,,,,,Homo sapiens,,,2012-11-15,2016-09-14
CDKL1,200083,Q00532,Cyclin-dependent kinase-like 1 (CDC2-related kinase); CDKL1; KKIALRE; P42,KINOMEscan,,,CDKL1,8814,Mammalian expression system,,,,Wild Type; Full length,,,,,Homo sapiens,,,2012-11-15,2016-09-14
CDKL2,200084,Q92772,Cyclin-dependent kinase-like 2 (CDC2-related kinase); CDKL2; KKIAMRE; P56,KINOMEscan,,,CDKL2,8999,Bacterial expression system,,,,Wild Type; Partial length,,,,,Homo sapiens,,,2012-11-15,2016-09-14
CDKL3,200085,Q8IVW4,Cyclin-dependent kinase-like 3; CDKL3; NKIAMRE,KINOMEscan,,,CDKL3,51265,Bacterial expression system,,,,Wild Type; Partial length,,,,,Homo sapiens,,,2012-11-15,2016-09-14
CDKL5,200086,O76039,Cyclin-dependent kinase-like 5; CDKL5; ISSX; STK9,KINOMEscan,,,CDKL5,6792,Mammalian expression system,,,,Wild Type; Partial length,,,,,Homo sapiens,,,2012-11-15,2016-09-14
CHEK1,200087,O14757,CHK1 checkpoint homolog (S. pombe); CHEK1; CHK1,KINOMEscan,,,CHEK1,1111,Bacterial expression system,,,,Wild Type; Partial length,,,,,Homo sapiens,,,2012-11-15,2016-09-14
CHK2,200088,O96017,Serine/threonine-protein kinase Chk2; CHK2 checkpoint homolog,KINOMEscan,,,CHEK2,11200,Bacterial expression system,,,,Wild Type; Partial length,,,,,Homo sapiens,,,2012-11-15,2016-09-14
CIT,200089,O14578,"Citron (rho-interacting, serine/threonine kinase 21); CIT; CRIK; KIAA0949; STK21",KINOMEscan,,,CIT,11113,Bacterial expression system,,,,Wild Type; Partial length,,,,,Homo sapiens,,,2012-11-15,2016-09-14
CLK1,200090,P49759,CDC-like kinase 1; CLK; CLK/STY; CLK1; STY,KINOMEscan,,,CLK1,1195,Bacterial expression system,,,,Wild Type; Full length,,,,,Homo sapiens,,,2012-11-15,2016-09-14
CLK2,200091,P49760,Dual specificity protein kinase CLK2; CDC-like kinase 2; CLK2; hCLK2; MGC61500,KINOMEscan,,,CLK2,1196,Bacterial expression system,,,,Wild Type; Partial length,,,,,Homo sapiens,,,2012-11-15,2016-09-14
CLK3,200092,P49761,Dual specificity protein kinase CLK3; CDC-like kinase 3; CLK3; FLJ22858; PHCLK3; PHCLK3/152,KINOMEscan,,,CLK3,1198,Bacterial expression system,,,,Wild Type; Full length,,,,,Homo sapiens,,,2012-11-15,2016-09-14
CLK4,200093,Q9HAZ1,CDC-like kinase 4; CLK4; DKFZp686A20267,KINOMEscan,,,CLK4,57396,Bacterial expression system,,,,Wild Type; Partial length,,,,,Homo sapiens,,,2012-11-15,2016-09-14
CSF1R,200094,P07333,Colony stimulating factor 1 receptor; CD115; C-FMS; CSF1R; CSF-1R; CSF-1-R; CSFR; FIM2; FIM-2; FMS; Fms/CSFR,KINOMEscan,,,CSF1R,1436,Bacterial expression system,,,,Wild Type; Partial length,,,,,Homo sapiens,,,2012-11-15,2016-09-14
CSK,200095,P41240,C-src tyrosine kinase; CSK; MGC117393,KINOMEscan,,,CSK,1445,Bacterial expression system,,,,Wild Type; Full length,,,,,Homo sapiens,,,2012-11-15,2016-09-14
CSNK1A1,200096,P48729,"Casein kinase 1, alpha 1; CK1; CK1a; CSNK1A1; HLCDGP1; PRO2975",KINOMEscan,,,CSNK1A1,1452,Mammalian expression system,,,,Wild Type; Partial length,,,,,Homo sapiens,,,2012-11-15,2016-09-14
CSNK1A1L,200097,Q8N752,"Casein kinase 1, alpha 1-like; CK1; CK1a2; CSNK1A1L; MGC33182",KINOMEscan,,,CSNK1A1L,122011,Bacterial expression system,,,,Wild Type; Full length,,,,,Homo sapiens,,,2012-11-15,2016-09-14
CSNK1D,200098,P48730,"Casein kinase 1, delta; CK1d; CSNK1D; HCKID",KINOMEscan,,,CSNK1D,1453,Bacterial expression system,,,,Wild Type; Full length,,,,,Homo sapiens,,,2012-11-15,2016-09-14
CSNK1E,200099,P49674,"Casein kinase 1, epsilon; CK1e; CSNK1E; HCKIE; MGC10398",KINOMEscan,,,CSNK1E,1454,Bacterial expression system,,,,Wild Type; Full length,,,,,Homo sapiens,,,2012-11-15,2016-09-14
KC1G1,200100,Q9HCP0,Casein kinase I isoform gamma-1; CK1g1; CSNK1G1,KINOMEscan,,,CSNK1G1,53944,Bacterial expression system,,,,Wild Type; Partial length,,,,,Homo sapiens,,,2012-11-15,2016-09-14
KC1G2,200101,P78368,"Casein kinase I isoform gamma-2; Casein kinase 1, gamma 2; CK1g2; CSNK1G2",KINOMEscan,,,CSNK1G2,1455,Bacterial expression system,,,,Wild Type; Full length,,,,,Homo sapiens,,,2012-11-15,2016-09-14
CSNK1G3,200102,Q9Y6M4,"Casein kinase 1, gamma 3; CK1g3; CSNK1G3",KINOMEscan,,,CSNK1G3,1456,Bacterial expression system,,,,Wild Type; Full length,,,,,Homo sapiens,,,2012-11-15,2016-09-14