Name,HMS LINCS ID,UniProt ID,Alternative Names,Provider,Provider Catalog ID,Amino Acid Sequence,Gene Symbol,Gene ID,Protein Source,Mutation,Phosphlorylation State,Domain,Protein Description,Protein Purity,Protein Complex,Isoform,Protein Type,Source Organism,Reference,Comments,Date Publicly Available,Most Recent Update
Akt-1,200482,P31749,RAC-alpha serine/threonine-protein kinase; Protein kinase B; PKB; Protein kinase B alpha; PKB alpha; Proto-oncogene c-Akt; RAC-PK-alpha,,,,AKT1,207,,,,,,,,,,Homo sapiens,,,,2016-09-14
Akt-2,200483,P31751,RAC-beta serine/threonine-protein kinase; Protein kinase Akt-2; Protein kinase B beta; PKB beta; RAC-PK-beta,,,,AKT2,208,,,,,,,,,,Homo sapiens,,,,2016-09-14
Akt-3,200484,Q9Y243,RAC-gamma serine/threonine-protein kinase; Protein kinase Akt-3; Protein kinase B gamma; PKB gamma; RAC-PK-gamma; STK-2,,,,AKT3,10000,,,,,,,,,,Homo sapiens,,,,2016-09-14
EGFR,200507,P00533,Epidermal growth factor receptor; Proto-oncogene c-ErbB-1; Receptor tyrosine-protein kinase erbB-1,,,,EGFR,1956,,,,,,,,,,Homo sapiens,,,,2016-09-14
mTOR,200537,P42345,Serine/threonine-protein kinase mTOR; FK506-binding protein 12-rapamycin complex-associated protein 1; FKBP12-rapamycin complex-associated protein; Mammalian target of rapamycin; Mechanistic target of rapamycin; Rapamycin and FKBP12 target 1; Rapamycin target protein 1,,,,MTOR,,,,,,,,,,,,,,,2016-09-14
p53,200543,P04637,Cellular tumor antigen p53; Antigen NY-CO-13; Phosphoprotein p53; Tumor suppressor p53,,,,TP53,7157,,,,,,,,,,Homo sapiens,,,,2016-09-14
VEGFR-2,200598,P35968,Vascular endothelial growth factor receptor 2; Fetal liver kinase 1; FLK-1; Kinase insert domain receptor; KDR; Protein-tyrosine kinase receptor flk-1; CD309; VEGFR2,,,,KDR,3791,,,,,,,,,,,,,,2016-09-14
H3 (pS10),201294,P68431,,,,,HIST1H3A,8350,,,pS10,,,,,,histone,Homo sapiens,,,2015-08-05,2016-09-14
p21,201295,P38936,Cyclin-dependent kinase inhibitor 1; CDK-interacting protein 1; Melanoma differentiation-associated protein 6; MDA-6,,,,CDKN1A,1026,,,,,,,,,,Homo sapiens,,,2015-08-05,2016-09-14
KI-67,201296,P46013,Antigen KI-67,,,,MKI67,4288,,,,,,,,,,Homo sapiens,,,2015-08-05,2016-09-27
Rb (pS807; pS811),201297,P06400,,,,,RB1,5925,,,pS807; pS811,,,,,,,Homo sapiens,,,2015-08-05,2016-09-14
S6 (pS235; pS236),201298,P62753,,,,,RPS6,6194,,,pS235; pS236,,,,,,,Homo sapiens,,,2015-08-05,2016-09-14
S6 (pS240; pS244),201299,P62753,,,,,RPS6,6194,,,pS240; pS244,,,,,,,Homo sapiens,,,2015-08-05,2016-09-14
PCNA,201302,P12004,Proliferating cell nuclear antigen; Cyclin,,,,PCNA,5111,,,,,,,,,,Homo sapiens,,,2015-12-11,2016-09-14
ERK-1 (pT202; pY204),201303,P27361,,,,,MAPK3,5595,,,pT202; pY204,,,,,,,Homo sapiens,,,2015-12-11,2016-09-14
ERK-2 (pT185; pY187),201304,P28482,,,,,MAPK1,5594,,,pT185; pY187,,,,,,,Homo sapiens,,,2015-12-11,2016-09-14
K4,201305,P19013,"Keratin, type II cytoskeletal 4; Cytokeratin-4; CK-4; Keratin-4; Type-II keratin Kb4",,,,KRT4,3851,,,,,,,,,,Homo sapiens,,,2015-12-11,2016-09-14
K5,201306,P13647,"Keratin, type II cytoskeletal 5; 58 kDa cytokeratin; Cytokeratin-5; CK-5; Keratin-5; Type-II keratin Kb5",,,,KRT5,3852,,,,,,,,,,Homo sapiens,,,2015-12-11,2016-09-14
K6A,201307,P02538,"Keratin, type II cytoskeletal 6A; Cytokeratin-6A; CK-6A; Cytokeratin-6D; CK-6D; Keratin-6A; Type-II keratin Kb6; Hom s 5",,,,KRT6A,3853,,,,,,,,,,Homo sapiens,,,2015-12-11,2016-09-14
K6B,201308,P04259,"Keratin, type II cytoskeletal 6B; Cytokeratin-6B; CK-6B; Keratin-6B; Type-II keratin Kb10",,,,KRT6B,3854,,,,,,,,,,Homo sapiens,,,2015-12-11,2016-09-14
K6C,201309,P48668,"Keratin, type II cytoskeletal 6C; Cytokeratin-6C; CK-6C; Cytokeratin-6E; CK-6E; Keratin K6h; Keratin-6C; Type-II keratin Kb12",,,,KRT6C,286887,,,,,,,,,,Homo sapiens,,,2015-12-11,2016-09-14
K8,201310,P05787,"Keratin, type II cytoskeletal 8; Cytokeratin-8; CK-8; Type-II keratin Kb8",,,,KRT8,3856,,,,,,,,,,Homo sapiens,,,2015-12-11,2016-09-14
K10,201311,P13645,"Keratin, type I cytoskeletal 10; Cytokeratin-10; CK-10",,,,KRT10,3858,,,,,,,,,,Homo sapiens,,,2015-12-11,2016-09-14
K13,201312,P13646,"Keratin, type I cytoskeletal 13; Cytokeratin-13; CK-13",,,,KRT13,3860,,,,,,,,,,Homo sapiens,,,2015-12-11,2016-09-14
K18,201313,P05783,"Keratin, type I cytoskeletal 18; Cell proliferation-inducing gene 46 protein; Cytokeratin-18; CK-18",,,,KRT18,3875,,,,,,,,,,Homo sapiens,,,2015-12-11,2016-09-14
H2A.X (pS139),201314,P16104,,,,,H2AFX,3014,,,pS139,,,,,,histone,Homo sapiens,,,2015-12-11,2016-09-14
Beta-actin,201316,P60709,"Actin, cytoplasmic 1",,,,ACTB,60,,,,,,,,,,Homo sapiens,,,2015-12-11,2016-09-14
Vimentin,201348,P08670,,,,,,,,,,,,,,,,,,,2016-09-14,2016-09-14
Rb (pS807),201335,P06400,,,,,,,,,pS807,,,,,,,,,,2016-09-14,2016-09-14
Rb (pS811),201336,P06400,,,,,,,,,pS811,,,,,,,,,,2016-09-14,2016-09-14
ERK-1 (pT202),201337,P27361,,,,,,,,,pT202,,,,,,,,,,2016-09-14,2016-09-14
ERK-2 (pT185),201338,P28482,,,,,,,,,pT185,,,,,,,,,,2016-09-14,2016-09-14
Aurora kinase A (pT288),201339,O14965,,,,,,,,,pT288,,,,,,,,,,2016-09-14,2016-09-14
Aurora kinase B (pT232),201340,Q96GD4,,,,,,,,,pT232,,,,,,,,,,2016-09-14,2016-09-14
Aurora kinase C (pT198),201341,Q9UQB9,,,,,,,,,pT198,,,,,,,,,,2016-09-14,2016-09-14
S6,201342,P62753,"40S ribosomal protein S6, Phosphoprotein NP33",,,,,,,,,,,,,,,,,,2016-09-14,2016-09-14
PARP-1 (D214-cleaved),201343,P09874,,,,,,,,,D214-cleaved,,,,,,,,,,2016-09-14,2016-09-14
p27Kip1,201344,P46527,Cyclin-dependent kinase inhibitor 1B; Cyclin-dependent kinase inhibitor p27,,,,,,,,,,,,,,,,,,2016-09-14,2016-09-14
NF-kB p65,201349,Q04206,Transcription factor p65; Nuclear factor NF-kappa-B p65 subunit; Nuclear factor of kappa light polypeptide gene enhancer in B-cells 3,,,,,,,,,,,,,,,,,,2016-09-14,2016-09-14
FOXO3a,201350,O43524,Forkhead box protein O3; AF6q21 protein; Forkhead in rhabdomyosarcoma-like 1,,,,,,,,,,,,,,,,,,2016-09-14,2016-09-14
Cyclin-D1,201351,P24385,G1/S-specific cyclin-D1; B-cell lymphoma 1 protein; BCL-1; BCL-1 oncogene; PRAD1 oncogene,,,,,,,,,,,,,,,,,,2016-09-14,2016-09-14
BAX,201352,Q07812,Apoptosis regulator BAX; Bcl-2-like protein 4; Bcl2-L-4,,,,,,,,,,,,,,,,,,2016-09-14,2016-09-14
E-cadherin,201353,P12830,CAM 120/80; Epithelial cadherin; E-cadherin; Uvomorulin; CD324,,,,,,,,,,,,,,,,,,2016-09-14,2016-09-14
EGF,201357,P01133,Epidermal Growth Factor; Urogastrone; URG,PeproTech,AF-100-15,NSDSECPLSHDGYCLHDGVCMYIEALDKYACNCVVGYIGERCQYRDLKWWELR,,,E.coli,,,,,greater than 98% by SDS-PAGE gel and HPLC analyses (source: PeproTech),,,,,,,2016-09-14,2016-09-14
