HMS LINCS Batch ID,HMS LINCS ID,Name,Alternative Names,Clone Name,Resource Identification Initiative ID,LINCS ID,Type,Nominal Non-protein Target,Organism of Nominal Target,Other Target Information,Immunogen,Immunogen Sequence,Fc Domain Source Species,Clonality,Fc Domain Isotype,Source Organism for Production,Production Details,Conjugate or Label,Labeling Details,Relevant Citations,Comments,Provider,Provider Catalog  ID,Provider Batch ID,Purity,Date Publicly Available,Most Recent Update
80001-1,80001,H3 (pS10),Phospho-Histone H3 (Ser10) (D2C8) XP® Rabbit mAb (Alexa Fluor® 555 Conjugate) #3475,D2C8,AB_10694639,,natural,,Homo sapiens,"Phospho-Histone H3 (Ser10) (D2C8) XP® Rabbit mAb (Alexa Fluor® 555 Conjugate) detects endogenous levels of histone H3 only when phosphorylated at Ser10. The antibody does not cross-react with other phosphorylated histones or with acetylated histones. Species Reactivity: Human, Mouse, Rat, Monkey, Zebrafish. (source: Cell Signaling Technology)",Monoclonal antibody is produced by immunizing animals with a synthetic phosphopeptide corresponding to residues surrounding Ser10 of human histone H3. (source: Cell Signaling Technology),,rabbit,monoclonal,IgG,rabbit,,Alexa Fluor 555,This antibody was conjugated to Alexa Fluor® 555 under optimal conditions with an F/P ratio of 2-6. (source: Cell Signaling Technology),,,Cell Signaling Technology,3475S,2,,2015-09-16,2016-09-14
80002-2,80002,p21 / Alexa Fluor 647,p21 Waf1/Cip1 (12D1) Rabbit mAb (Alexa Fluor® 647 Conjugate) #8587,12D1,AB_10892861,,natural,,Homo sapiens,"p21 Waf1/Cip1 (12D1) Rabbit mAb (Alexa Fluor® 647 Conjugate) detects endogenous levels of total p21 protein. The antibody does not cross-react with other CDK inhibitors. Species Reactivity: Human, Monkey. Species predicted to react based on 100% sequence homology: Dog. (source: Cell Signaling Technology)",Monoclonal antibody is produced by immunizing animals with a synthetic peptide corresponding to residues near the carboxy terminus of human p21 protein. (source: Cell Signaling Technology),,rabbit,monoclonal,IgG,rabbit,,Alexa Fluor 647,,,,Cell Signaling Technology,8587S,3,,2015-09-16,2016-09-14
80003-1,80003,KI-67 / clone D3B5,Ki-67 (D3B5) Rabbit mAb (Alexa Fluor® 488 Conjugate) #11882,D3B5,,,natural,,Homo sapiens,"Ki-67 (D3B5) Rabbit mAb (Alexa Fluor® 488 Conjugate) recognizes endogenous levels of total Ki-67 protein. Species Reactivity: Human, Mouse, Rat. (source: Cell Signaling Technology)",Monoclonal antibody is produced by immunizing animals with recombinant protein specific to the amino terminus of human Ki-67 protein. (source: Cell Signaling Technology),,rabbit,monoclonal,IgG,rabbit,,Alexa Fluor 488,,,,Cell Signaling Technology,11882S,4,,2015-09-16,2016-12-22
80004-1,80004,Rb (pS807; pS811); Rb (pS807); Rb (pS811) / clone D20B12 / Alexa Fluor 555,Phospho-Rb (Ser807/811) (D20B12) XP® Rabbit mAb (Alexa Fluor® 555 Conjugate) #8957,D20B12,,,natural,,Homo sapiens,"Phospho-Rb (Ser807/811) (D20B12) XP® Rabbit mAb (Alexa Fluor® 555 Conjugate) recognizes endogenous levels of Rb protein only when phosphorylated at Ser807, Ser811, or at both sites. This antibody does not cross-react with Rb phosphorylated at Ser608. Species Reactivity: Human, Mouse, Rat, Monkey. (source: Cell Signaling Technology)",Monoclonal antibody is produced by immunizing animals with a synthetic phosphopeptide corresponding to residues surrounding Ser807/811 of human Rb protein. (source: Cell Signaling Technology),,rabbit,monoclonal,IgG,rabbit,,Alexa Fluor 555,,,,Cell Signaling Technology,8957S,1,,2015-09-16,2016-09-14
80005-1,80005,S6 (pS235; pS236) / Alexa Fluor 647,Phospho-S6 Ribosomal Protein (Ser235/236) (D57.2.2E) XP® Rabbit mAb (Alexa Fluor® 647 Conjugate) #4851,D57.2.2E,AB_916160,,natural,,Homo sapiens,"Phospho-S6 Ribosomal Protein (Ser235/236) (D57.2.2E) XP® Rabbit mAb (Alexa Fluor® 647 Conjugate) detects endogenous levels of ribosomal protein S6 only when phosphorylated at Ser235 and 236. Species Reactivity: Human, Mouse, Rat, Monkey, Mink, S. cerevisiae. Species predicted to react based on 100% sequence homology: Chicken, Pig. (source: Cell Signaling Technology)",Monoclonal antibody is produced by immunizing animals with a synthetic phosphopeptide corresponding to residues surrounding Ser235 and Ser236 of human ribosomal protein S6. (source: Cell Signaling Technology),,rabbit,monoclonal,IgG,rabbit,,Alexa Fluor 647,,,,Cell Signaling Technology,4851S,22,,2015-09-16,2016-09-14
80006-1,80006,S6 (pS240; pS244) / Alexa Fluor 488,Phospho-S6 Ribosomal Protein (Ser240/244) (D68F8) XP®Rabbit mAb (Alexa Fluor® 488 Conjugate) #5018,D68F8,AB_10695861,,natural,,Homo sapiens,"Phospho-S6 Ribosomal Protein (Ser240/244) (D68F8) XP® Rabbit mAb (Alexa Fluor® 488 Conjugate) detects endogenous levels of S6 ribosomal protein only when phosphorylated at Ser240 and Ser244. Species Reactivity: Human, Mouse, Rat, Monkey. Species predicted to react based on 100% sequence homology: Chicken, Pig. (source: Cell Signaling Technology)",Monoclonal antibody is produced by immunizing animals with a synthetic phosphopeptide corresponding to residues surrounding Ser240 and Ser244 of human ribosomal protein S6. (source: Cell Signaling Technology),,rabbit,monoclonal,IgG,rabbit,,Alexa Fluor 488,,,,Cell Signaling Technology,5018S,4,,2015-09-16,2016-09-14
80007-1,80007,rabbit IgG(H+L) / goat / cross-adsorbed,"Goat anti-Rabbit IgG (H+L) Secondary Antibody, Alexa Fluor® 488 conjugate",,AB_143165,,natural,,Oryctolagus cuniculus,"Tested species reactivity: Rabbit. Published species reactivity: Porcine, Human. (source: Invitrogen)",gamma immunoglobin heavy and light chains (source: Invitrogen),,goat,polyclonal,IgG,goat,,Alexa Fluor 488,,,,Invitrogen / Life Technologies,A-11008,,"In the first round of purification, whole immunoglobulins binding to the immunizing antibody are recovered and mainly consist of the ~150-kDa IgG class. Further purification with Protein A or G removes all immunoglobulin classes except IgG such that the affinity-purified antibodies react with IgG heavy chains and all classes of immunoglobulin light chains from rabbit. To minimize cross-reactivity, these goat anti-rabbit whole antibodies have been cross-adsorbed against human IgG, human serum, mouse IgG, mouse serum, and bovine serum. (source: Invitrogen)",2015-09-16,2017-05-12
80008-1,80008,EGFR,EGF Receptor (D38B1) XP® Rabbit mAb (Alexa Fluor® 488 Conjugate) #5616,D38B1,AB_10691853,,natural,,Homo sapiens,"EGF Receptor (D38B1) XP® Rabbit mAb (Alexa Fluor® 488 Conjugate) detects endogenous levels of total EGF receptor protein. The antibody does not cross-react with other proteins of the ErbB family. Species Reactivity: Human, Mouse, Monkey. (source: Cell Signaling Technology)",Monoclonal antibody is produced by immunizing animals with a fusion protein containing the cytoplasmic domain of human EGF receptor protein. (source: Cell Signaling Technology),,rabbit,monoclonal,IgG,rabbit,,Alexa Fluor 488,,,,Cell Signaling Technology,5616S,4,,2016-02-18,2016-09-14
80011-1,80011,PCNA,PCNA (PC10) Mouse mAb (Alexa Fluor® 488 Conjugate) #8580,PC10,AB_11178664,,natural,,,"PCNA (PC10) Mouse mAb (Alexa Fluor® 488 Conjugate) detects endogenous levels of total PCNA protein. Species Reactivity: Human, Mouse, Rat, Monkey, Bovine, Pig. (source: Cell Signaling Technology)",Monoclonal antibody is produced by immunizing animals with a recombinant Protein A-PCNA fusion protein obtained from pC2T. (source: Cell Signaling Technology),,mouse,monoclonal,IgG2a,mouse,,Alexa Fluor 488,,,,Cell Signaling Technology,8580S,1,,2016-02-18,2016-09-14
80012-1,80012,ERK-1 (pT202; pY204); ERK-1 (pT202); ERK-2 (pT185; pY187); ERK-2 (pT185) / Alexa Fluor 488,Phospho-p44/42 MAPK (Erk1/2) (Thr202/Tyr204) (D13.14.4E) XP® Rabbit mAb (Alexa Fluor® 488 Conjugate) #4344,D13.14.4E,AB_2139960,,natural,,Homo sapiens,"Phospho-p44/42 MAPK (Erk1/2) (Thr202/Tyr204) (D13.14.4E) XP® Rabbit mAb (Alexa Fluor® 488 Conjugate) detects endogenous levels of p44 and p42 MAP Kinase (Erk1 and Erk2) when either dually phosphorylated at Thr202 and Tyr204 of Erk1 (Thr185 and Tyr187 of Erk2), or singly phosphorylated at Thr202. This antibody does not cross-react with the corresponding phosphorylated residues of either JNK/SAPK or p38 MAP kinases. Species predicted to react based on 100% sequence homology: Chicken, C. elegans. (source: Cell Signaling Technology)",Monoclonal antibody is produced by immunizing animals with a synthetic phosphopeptide corresponding to residues surrounding Thr202/Tyr204 of human p44 MAP kinase. (source: Cell Signaling Technology),,rabbit,monoclonal,IgG,rabbit,,Alexa Fluor 488,The antibody was conjugated to Alexa Fluor® 488 under optimal conditions with an F/P ratio of 2-6. (source: Cell Signaling Technology),,,Cell Signaling Technology,4344S,12,,2016-02-18,2017-05-12
80013-1,80013,Keratin,Pan-Keratin (C11) Mouse mAb (Alexa Fluor® 555 Conjugate) #3478,C11,AB_10829040,,natural,,Homo sapiens,"Pan-Keratin (C11) Mouse mAb (Alexa Fluor® 555 Conjugate) detects endogenous levels of total keratins 4, 5, 6, 8, 10, 13 and 18. The antibody does not cross-react with other keratins. Species Reactivity: Human, Mouse, Rat, Monkey. (source: Cell Signaling Technology)",Monoclonal antibody is produced by immunizing animals with a cytoskeleton preparation from A-431 cells. (source: Cell Signaling Technology),,mouse,monoclonal,IgG1,mouse,,Alexa Fluor 555,The antibody was conjugated to Alexa Fluor® 555 under optimal conditions with an F/P ratio of 2-6. (source: Cell Signaling Technology),,,Cell Signaling Technology,3478S,4,,2016-02-18,2016-09-14
80016-1,80016,Beta-actin,β-Actin (13E5) Rabbit mAb (Alexa Fluor® 555 Conjugate) #8046,13E5,AB_11179208,,natural,,Homo sapiens,"β-Actin (13E5) Rabbit mAb (Alexa Fluor® 555 Conjugate) detects endogenous levels of total β-actin protein. This antibody may cross-react with the γ-actin (cytoplasmic isoform). It does not cross-react with α-skeletal, α-cardiac, α-vascular smooth, or γ-enteric smooth muscle isoforms. Species Reactivity: Human, Mouse, Rat, Monkey, Bovine, Pig. Species predicted to react based on 100% sequence homology: Hamster, Chicken, Dog, Horse. (source: Cell Signaling Technology)",Monoclonal antibody is produced by immunizing animals with a synthetic peptide corresponding to residues near the amino-terminus of human β-actin protein. (source: Cell Signaling Technology),,rabbit,monoclonal,IgG,rabbit,,Alexa Fluor 555,,,,Cell Signaling Technology,8046S,1,,2016-02-18,2016-09-14
80022-1,80022,p53,p53 Antibody (DO-1): sc-126,DO-1,AB_628082,,natural,,Homo sapiens,recommended for detection of wt and mutant p53 of human origin (source: Santa Cruz Biotechnology),N-terminal epitope mapping between amino acid residues 11-25 of p53 of human origin (source: Santa Cruz Biotechnology),,mouse,monoclonal,IgG2a,mouse,,,,,,Santa Cruz Biotechnology,sc-126,G2513,,2016-02-18,2016-09-14
80024-1,80024,mouse IgG(H+L) / goat,"Goat anti-Mouse IgG (H+L) Secondary Antibody, Alexa Fluor® 647 conjugate",,AB_10564125,,natural,,Mus musculus,Tested species reactivity: Mouse. Published species reactivity: Not Applicable. (source: Invitrogen),gamma immunoglobin heavy and light chains (source: Invitrogen),,goat,polyclonal,IgG,goat,,Alexa Fluor 647,,,,Invitrogen / Life Technologies,A-21236,,"To minimize cross-reactivity, these goat anti-mouse IgG (H+L) whole secondary antibodies have been affinity purified and cross-adsorbed against bovine IgG, goat IgG, rabbit IgG, rat IgG, human IgG, and human serum. (source: Invitrogen)",2016-02-18,2016-09-14
80025-1,80025,Aurora kinase A (pT288); Aurora kinase B (pT232); Aurora kinase C (pT198),Phospho-Aurora A (Thr288)/Aurora B (Thr232)/Aurora C (Thr198) (D13A11) XP® Rabbit mAb (Alexa Fluor® 555 Conjugate) #13464,D13A11,,,natural,,Homo sapiens,"Phospho-Aurora A (Thr288)/Aurora B (Thr232)/Aurora C (Thr198) (D13A11) XP® Rabbit mAb (Alexa Fluor® 555 Conjugate) detects endogenous levels of Aurora A/B/C protein only when phosphorylated at Thr288, Thr232, or Thr198, respectively. Species Reactivity: Human, Mouse, Rat. (source: Cell Signaling Technology)",Monoclonal antibody is produced by immunizing animals with a synthetic peptide corresponding to residues surrounding Thr232 of human Aurora B protein. (source: Cell Signaling Technology),,rabbit,monoclonal,IgG,rabbit,,Alexa Fluor 555,,,,Cell Signaling Technology,13464S,1,,2016-09-14,2016-09-14
80026-1,80026,S6,S6 Ribosomal Protein (54D2) Mouse mAb (Alexa Fluor® 555 Conjugate) #6989,54D2,AB_10828226,,natural,,Homo sapiens,"S6 Ribosomal Protein (54D2) Mouse mAb (Alexa Fluor® 555 Conjugate) detects endogenous levels of total S6 ribosomal protein independent of phosphorylation. Species Reactivity: Human, Mouse, Rat, Monkey, D. melanogaster. (source: Cell Signaling Technology)",Monoclonal antibody is produced by immunizing animals with a recombinant fusion protein corresponding to full-length human S6 ribosomal protein. (source: Cell Signaling Technology),,mouse,monoclonal,IgG1,mouse,,Alexa Fluor 555,,,,Cell Signaling Technology,6989S,2,,2016-09-14,2016-09-14
80027-1,80027,VEGFR-2,VEGF Receptor 2 (D5B1) Rabbit mAb (Alexa Fluor® 555 Conjugate) #12872,D5B1,,,natural,,Homo sapiens,"VEGF Receptor 2 (D5B1) Rabbit mAb (Alexa Fluor® 555 Conjugate) recognizes endogenous levels of total VEGF receptor 2 protein. Species Reactivity: Human, Mouse, Rat. (source: Cell Signaling Technology)",Monoclonal antibody is produced by immunizing animals with a recombinant protein containing the carboxy-terminal 150 amino acid residues of human VEGF receptor 2 protein. (source: Cell Signaling Technology),,rabbit,monoclonal,IgG,rabbit,,Alexa Fluor 555,,,,Cell Signaling Technology,12872S,1,,2016-09-14,2016-09-14
80028-1,80028,PARP-1 (D214-cleaved),Cleaved PARP (Asp214) (D64E10) XP® Rabbit mAb (Alexa Fluor® 555 Conjugate) #6894,D64E10,AB_10830735,,natural,,Homo sapiens,"Cleaved-PARP (Asp214) (D64E10) XP® Rabbit mAb (Alexa Fluor® 555 Conjugate) detects endogenous levels of the large fragment (89 kDa) of human PARP1 protein produced by caspase cleavage. The antibody does not recognize full length PARP1 or other PARP isoforms. Species Reactivity: Human, Monkey. (source: Cell Signaling Technology)",Monoclonal antibodies are produced by immunizing animals with a synthetic peptide corresponding to residues surrounding Asp214 in human PARP protein. (source: Cell Signaling Technology),,rabbit,monoclonal,IgG,rabbit,,Alexa Fluor 555,,,,Cell Signaling Technology,6894S,1,,2016-09-14,2016-09-14
80029-1,80029,p27Kip1 / clone Y236,Anti-p27 KIP 1 antibody [Y236] (Alexa Fluor® 647) (ab194234),Y236,,,natural,,Homo sapiens,Reacts with: Rat (source: Abcam),Synthetic peptide (the amino acid sequence is considered to be commercially sensitive) corresponding to Human p27 KIP 1 aa 150 to the C-terminus (C terminal). (source: Abcam),,rabbit,monoclonal,IgG,rabbit,,Alexa Fluor 647,,,,Abcam,AB194234,GR200274-1,immunogen affinity purified (source: Abcam),2016-09-14,2016-09-14
80030-1,80030,H2A.X (pS139) / clone 20E3 / Alexa Fluor 647,Phospho-Histone H2A.X (Ser139) (20E3) Rabbit mAb (Alexa Fluor® 647 Conjugate) #9720,20E3,AB_10692910,,natural,,Homo sapiens,"Phospho-Histone H2A.X (Ser139) (20E3) Rabbit mAb detects endogenous levels of H2A.X only when phosphorylated at serine 139. Species Reactivity: Human, Mouse, Rat, Monkey. (source: Cell Signaling Technology)",Monoclonal antibody is produced by immunizing animals with a synthetic phosphopeptide corresponding to residues surrounding Ser139 of human H2A.X. (source: Cell Signaling Technology),,rabbit,monoclonal,IgG,rabbit,,Alexa Fluor 647,The antibody was conjugated to Alexa Fluor® 647 under optimal conditions with an F/P ratio of 2-5. (source: Cell Signaling Technology),,,Cell Signaling Technology,9720S,1,,2016-09-14,2016-09-14
80031-1,80031,AKT,Akt (pan) (C67E7) Rabbit mAb (Alexa Fluor® 647 Conjugate) #5186,C67E7,AB_10695877,,natural,,Mus musculus,"Akt (pan) (C67E7) Rabbit mAb (Alexa Fluor® 647 Conjugate) detects endogenous levels of total Akt protein. This antibody does not cross-react with other related proteins. Species Reactivity: Human, Mouse, Rat, Monkey, D. melanogaster. Species predicted to react based on 100% sequence homology: Pig. (source: Cell Signaling Technology)",Monoclonal antibody is produced by immunizing animals with a synthetic peptide corresponding to residues near the carboxy terminus sequence of mouse Akt. (source: Cell Signaling Technology),,rabbit,monoclonal,IgG,rabbit,,Alexa Fluor 647,,,,Cell Signaling Technology,5186S,3,,2016-09-14,2016-09-14
80032-1,80032,mTOR,mTOR (7C10) Rabbit mAb (Alexa Fluor® 647 Conjugate) #5048,7C10,AB_10828101,,natural,,Homo sapiens,"mTOR (7C10) Rabbit mAb (Alexa Fluor® 647 Conjugate) detects endogenous levels of total mTOR protein. Species Reactivity: Human, Mouse, Rat, Monkey. Species predicted to react based on 100% sequence homology: Horse. (source: Cell Signaling Technology)",Monoclonal antibody is produced by immunizing animals with a synthetic peptide corresponding to residues surrounding Ser2481 of human mTOR protein. (source: Cell Signaling Technology),,rabbit,monoclonal,IgG,rabbit,,Alexa Fluor 647,This antibody was conjugated to Alexa Fluor® 647 under optimal conditions with an F/P of 2-6. (source: Cell Signaling Technology),,,Cell Signaling Technology,5048S,2,,2016-09-14,2016-09-14
80033-1,80033,Vimentin,Vimentin (D21H3) XP® Rabbit mAb (Alexa Fluor® 647 Conjugate) #9856,D21H3,AB_10834530,,natural,,Homo sapiens,"Vimentin (D21H3) XP® Rabbit mAb (Alexa Fluor® 647 Conjugate) detects endogenous levels of total vimentin protein. Species Reactivity: Human, Mouse, Rat, Monkey. (source: Cell Signaling Technology)",Monoclonal antibody is produced by immunizing animals with a synthetic peptide corresponding to residues surrounding Arg45 of human vimentin protein. (source: Cell Signaling Technology),,rabbit,monoclonal,IgG,rabbit,,Alexa Fluor 647,This antibody was conjugated to Alexa Fluor® 647 under optimal conditions with an F/P ratio of 2-6. (source: Cell Signaling Technology),,,Cell Signaling Technology,9856S,7,,2016-09-14,2016-09-14
80034-1,80034,NF-kB p65,Anti-NF-kB p65 antibody [E379] (Alexa Fluor® 647) (ab190589),E379,,,natural,,Homo sapiens,Reacts with: Human. Predicted to work with: Mouse. (source: Abcam),Synthetic peptide (the amino acid sequence is considered to be commercially sensitive) within Human NF-kB p65 aa 500 to the C-terminus (C terminal). The exact sequence is proprietary. (source: Abcam),,rabbit,monoclonal,IgG,rabbit,,Alexa Fluor 647,,,,Abcam,AB190589,GR199457-1,immunogen affinity purified (source: Abcam),2016-09-14,2016-09-14
80035-1,80035,FOXO3a,FoxO3a (75D8) Rabbit mAb #2497,75D8,AB_836876,,natural,,Homo sapiens,"FoxO3a (75D8) Rabbit mAb detects exogenous and endogenous levels of total FoxO3a protein. The antibody does not detect the exogenously expressed family members FoxO4 or FoxO1. Species Reactivity: Human, Mouse, Rat, Monkey. (source: Cell Signaling Technology)",Monoclonal antibody is produced by immunizing animals with a synthetic peptide corresponding to residues surrounding Glu50 of human FoxO3a. (source: Cell Signaling Technology),,rabbit,monoclonal,IgG,rabbit,,,,,,Cell Signaling Technology,2497S,10,,2016-09-14,2016-09-14
80036-1,80036,Cyclin-D1,Anti-Cyclin D1 antibody [EPR2241] (Alexa Fluor® 488) (ab190194),EPR2241,,,natural,,Homo sapiens,"Reacts with: Mouse, Rat, Human. (source: Abcam)",Synthetic peptide (the amino acid sequence is considered to be commercially sensitive) corresponding to Human Cyclin D1 (C terminal). (source: Abcam),,rabbit,monoclonal,IgG,rabbit,,Alexa Fluor 488,,,,Abcam,AB190194,GR199456-1,immunogen affinity purified (source: Abcam),2016-09-14,2016-09-14
80037-1,80037,BAX,Alexa Fluor® 488 anti-Bax Antibody,2D2,AB_2562171,,natural,,Homo sapiens,Reactivity: Human. This antibody does not cross-react with Bcl-2 or Bcl-XL proteins. (source: BioLegend),Amino acids 3-16 of human Bax protein (source: BioLegend),,mouse,monoclonal,IgG1,mouse,,Alexa Fluor 488,The antibody was purified by affinity chromatography and conjugated with Alexa Fluor® 488 under optimal conditions. (source: BioLegend),,,BioLegend,633603,B169774,purified by affinity chromatography (source: Biolegend),2016-09-14,2016-09-14
80038-1,80038,E-cadherin,E-Cadherin (24E10) Rabbit mAb (Alexa Fluor® 488 Conjugate) #3199,24E10,AB_10691457,,natural,,Homo sapiens,"E-Cadherin (24E10) Rabbit mAb detects endogenous levels of total E-cadherin protein. The antibody does not cross-react with related family members, such as N-cadherin. Species Reactivity: Human, Mouse. Species predicted to react based on 100% sequence homology: Bovine, Dog, Pig. (source: Cell Signaling Technology)",Monoclonal antibody is produced by immunizing animals with a synthetic peptide corresponding to the sequence surrounding residue 780 of human E-cadherin. (source: Cell Signaling Technology),,rabbit,monoclonal,IgG,rabbit,,Alexa Fluor 488,The antibody was conjugated to Alexa Fluor® 488 under optimal conditions with an F/P ratio of 2-6. (source: Cell Signaling Technology),,,Cell Signaling Technology,3199S,11,,2016-09-14,2016-09-14
