Name,HMS LINCS ID,UniProt ID,Alternative Names,Provider,Provider Catalog ID,Amino Acid Sequence,Gene Symbol,Gene ID,Protein Source,Mutation,Phosphlorylation State,Domain,Protein Description,Protein Purity,Protein Complex,Isoform,Protein Type,Source Organism,Reference,Comments,Date Publicly Available,Most Recent Update
mTOR (pS2448),201369,P42345,,,,,,,,,pS2448,,,,,,,,,,2016-09-14,2016-09-14
CDK2 (pT160),201366,P24941,,,,,,,,,pT160,,,,,,,,,,2016-09-14,2016-09-14
GSK-3 alpha (pS21),201367,P49840,,,,,,,,,pS21,,,,,,,,,,2016-09-14,2016-09-14
GSK-3 beta (pS9),201368,P49841,,,,,,,,,pS9,,,,,,,,,,2016-09-14,2016-09-14
Cdc25C,201139,P30307,M-phase inducer phosphatase 3; Dual specificity phosphatase Cdc25C,,,,CDC25C,,,,,,,,,,,,,,,2016-09-14
p21,201295,P38936,Cyclin-dependent kinase inhibitor 1; CDK-interacting protein 1; Melanoma differentiation-associated protein 6; MDA-6,,,,CDKN1A,1026,,,,,,,,,,Homo sapiens,,,2015-08-05,2016-09-14
Rb (pS807; pS811),201297,P06400,,,,,RB1,5925,,,pS807; pS811,,,,,,,Homo sapiens,,,2015-08-05,2016-09-14
S6 (pS235; pS236),201298,P62753,,,,,RPS6,6194,,,pS235; pS236,,,,,,,Homo sapiens,,,2015-08-05,2016-09-14
S6 (pS240; pS244),201299,P62753,,,,,RPS6,6194,,,pS240; pS244,,,,,,,Homo sapiens,,,2015-08-05,2016-09-14
ERK-1 (pT202; pY204),201303,P27361,,,,,MAPK3,5595,,,pT202; pY204,,,,,,,Homo sapiens,,,2015-12-11,2016-09-14
ERK-2 (pT185; pY187),201304,P28482,,,,,MAPK1,5594,,,pT185; pY187,,,,,,,Homo sapiens,,,2015-12-11,2016-09-14
ERK-1 (pT202),201337,P27361,,,,,,,,,pT202,,,,,,,,,,2016-09-14,2016-09-14
ERK-2 (pT185),201338,P28482,,,,,,,,,pT185,,,,,,,,,,2016-09-14,2016-09-14
p27Kip1,201344,P46527,Cyclin-dependent kinase inhibitor 1B; Cyclin-dependent kinase inhibitor p27,,,,,,,,,,,,,,,,,,2016-09-14,2016-09-14
S6K-alpha-1 (pS380),201381,Q15418,,,,,,,,,pS380,,,,,,,,,,2016-09-14,2016-09-14
FOXO3a,201350,O43524,Forkhead box protein O3; AF6q21 protein; Forkhead in rhabdomyosarcoma-like 1,,,,,,,,,,,,,,,,,,2016-09-14,2016-09-14
Cyclin-D1,201351,P24385,G1/S-specific cyclin-D1; B-cell lymphoma 1 protein; BCL-1; BCL-1 oncogene; PRAD1 oncogene,,,,,,,,,,,,,,,,,,2016-09-14,2016-09-14
EGF,201357,P01133,Epidermal Growth Factor; Urogastrone; URG,PeproTech,AF-100-15,NSDSECPLSHDGYCLHDGVCMYIEALDKYACNCVVGYIGERCQYRDLKWWELR,,,E.coli,,,,,greater than 98% by SDS-PAGE gel and HPLC analyses (source: PeproTech),,,,,,,2016-09-14,2016-09-14
Cdc25A,201358,P30304,M-phase inducer phosphatase 1; Dual specificity phosphatase Cdc25A,,,,,,,,,,,,,,,,,,2016-09-14,2016-09-14
Cyclin-D2,201359,P30279,G1/S-specific cyclin-D2,,,,,,,,,,,,,,,,,,2016-09-14,2016-09-14
Cyclin-D3,201360,P30281,G1/S-specific cyclin-D3,,,,,,,,,,,,,,,,,,2016-09-14,2016-09-14
Cyclin-E1,201361,P24864,G1/S-specific cyclin-E1,,,,,,,,,,,,,,,,,,2016-09-14,2016-09-14
Cyclin-A1,201363,P78396,,,,,,,,,,,,,,,,,,,2016-09-14,2016-09-14
Cyclin-A2,201364,P20248,Cyclin-A,,,,,,,,,,,,,,,,,,2016-09-14,2016-09-14
Myt1 (pS83),201371,Q99640,,,,,,,,,pS83,,,,,,,,,,2016-09-14,2016-09-14
S6K-alpha-1 (pT359),201373,Q15418,,,,,,,,,pT359,,,,,,,,,,2016-09-14,2016-09-14
S6K-alpha-2 (pT365),201375,Q15349,,,,,,,,,pT365,,,,,,,,,,2016-09-14,2016-09-14
S6K-alpha-3 (pT356),201376,P51812,,,,,,,,,pT356,,,,,,,,,,2016-09-14,2016-09-14
S6K-alpha-1 (pT573),201377,Q15418,,,,,,,,,pT573,,,,,,,,,,2016-09-14,2016-09-14
Tuberin (pS1387),201379,P49815,,,,,,,,,pS1387,,,,,,,,,,2016-09-14,2016-09-14
WEE1hu (pS642),201380,P30291,,,,,,,,,pS642,,,,,,,,,,2016-09-14,2016-09-14
S6K-alpha-2 (pS377),201382,Q15349,,,,,,,,,pS377,,,,,,,,,,2016-09-14,2016-09-14
S6K-alpha-3 (pS386),201383,P51812,,,,,,,,,pS386,,,,,,,,,,2016-09-14,2016-09-14
Cyclin-B1,201384,P14635,G2/mitotic-specific cyclin-B1,,,,,,,,,,,,,,,,,,2016-09-14,2016-09-14
FoxM1,201385,Q08050,Forkhead box protein M1; Forkhead-related protein FKHL16; Hepatocyte nuclear factor 3 forkhead homolog 11; HFH-11; HNF-3/fork-head homolog 11; M-phase phosphoprotein 2; MPM-2 reactive phosphoprotein 2; Transcription factor Trident; Winged-helix factor from INS-1 cells,,,,,,,,,,,,,,,,,,2016-09-14,2016-09-14
CDK1 (pY15),201386,P06493,,,,,,,,,pY15,,,,,,,,,,2016-09-14,2016-09-14
CDK2 (pY15),201387,P24941,,,,,,,,,pY15,,,,,,,,,,2016-09-14,2016-09-14
p27Kip1 (pS10),201388,P46527,,,,,,,,,pS10,,,,,,,,,,2016-09-14,2016-09-14
p57Kip2,201389,P49918,Cyclin-dependent kinase inhibitor 1C; Cyclin-dependent kinase inhibitor p57,,,,,,,,,,,,,,,,,,2016-09-14,2016-09-14
4EBP1 (pT37; pT46),201396,Q13541,,,,,,,,,pT37; pT46,,,,,,,,,,2016-09-14,2016-09-14
4EBP1 (pT37),201397,Q13541,,,,,,,,,pT37,,,,,,,,,,2016-09-14,2016-09-14
4EBP1 (pT46),201398,Q13541,,,,,,,,,pT46,,,,,,,,,,2016-09-14,2016-09-14
