Name,HMS LINCS ID,UniProt ID,Alternative Names,Provider,Provider Catalog ID,Amino Acid Sequence,Gene Symbol,Gene ID,Protein Source,Mutation,Phosphlorylation State,Domain,Protein Description,Protein Purity,Protein Complex,Isoform,Protein Type,Source Organism,Reference,Comments,Date Publicly Available,Most Recent Update
ATM,200642,Q13315,Serine-protein kinase ATM,KiNativ,,QLVkGRDDLRQDAVMQQVFQMCNTLLQR,,,,,,,,,,,,,,,,2016-09-14
ATR,200643,Q13535,Serine/threonine-protein kinase ATR,KiNativ,,FYIMMCkPK,,,,,,,,,,,,,,,,2016-09-14
ACK,200635,Q07912,Activated CDC42 kinase 1,KiNativ,,TVSVAVKCLkPDVLSQPEAMDDFIR,,,,,,,,,,,,,,,,2016-09-14
"AMPKa1,AMPKa2",200639,Q13131,5'-AMP-activated protein kinase catalytic subunit alpha-1,KiNativ,,DLkPENVLLDAHMNAK,,,,,,,,,,,,,,,,2016-09-14
"AMPKa1,AMPKa2",200640,Q13131,5'-AMP-activated protein kinase catalytic subunit alpha-1,KiNativ,,VAVkILNR,,,,,,,,,,,,,,,,2016-09-14
BRAF,200647,P15056,Serine/threonine-protein kinase B-raf; v-raf murine sarcoma viral oncogene homolog B1; BRAF1; RAFB1,KiNativ,,DLkSNNIFLHEDLTVK,,,,,,,,,,,,,,,,2016-09-14
CaMK1a,200648,Q14012,Calcium/calmodulin-dependent protein kinase I; CAMK1; CaMK1a; CAMKI; MGC120317; MGC120318,KiNativ,,LVAIkCIAK,,,,,,,,,,,,,,,,2016-09-14
KCC2D,200649,Q13557,Calcium/calmodulin-dependent protein kinase type II subunit delta; CaM kinase II subunit delta; CAMK2D; CAMKD; DKFZp686G23119; DKFZp686I2288; MGC44911,KiNativ,,IPTGQEYAAkIINTK,CAMK2D,817,,,,,,,,,,Homo sapiens,,,,2016-09-14
CaMK2g,200650,Q13555,Calcium/calmodulin-dependent protein kinase type II gamma chain,KiNativ,,TSTQEYAAkIINTK,,,,,,,,,,,,,,,,2016-09-14
CaMKK2,200652,Q96RR4,Calcium/calmodulin-dependent protein kinase kinase 2,KiNativ,,LAYNENDNTYYAMkVLSK,,,,,,,,,,,,,,,,2016-09-14
CDC2,200654,P06493,Cell division control protein 2 homolog,KiNativ,,DLkPQNLLIDDKGTIK,,,,,,,,,,,,,,,,2016-09-14
"CDK11,CDK8",200656,P49336,Cell division protein kinase 8,KiNativ,,DLkPANILVMGEGPER,,,,,,,,,,,,,,,,2016-09-14
CDK2,200657,P24941,Cyclin-dependent kinase 2; p33 protein kinase,KiNativ,,NKLTGEVVALkK,,,,,,,,,,,,,,,,2016-09-14
CDK2,200658,P24941,Cyclin-dependent kinase 2; p33 protein kinase,KiNativ,,DLkPQNLLINTEGAIK,,,,,,,,,,,,,,,,2016-09-14
CDK4,200659,P11802,Cyclin-dependent kinase 4; cell division protein kinase 4,KiNativ,,DLkPENILVTSGGTVK,,,,,,,,,,,,,,,,2016-09-14
CDK5,200661,Q00535,Cyclin-dependent kinase 5; cell division protein kinase 5; PSSALRE,KiNativ,,NRETHEIVALkR,,,,,,,,,,,,,,,,2016-09-14
CDK6,200662,Q00534,Cyclin-dependent kinase 6; cell division protein kinase 6,KiNativ,,DLkPQNILVTSSGQIK,CDK6,,,,,,,,,,,Homo sapiens,,,,2016-09-14
CDK7,200663,P50613,Cyclin-dependent kinase 7; cell division protein kinase 7; CAK1; CDK7; CDKN7; MO15; p39MO15; STK1,KiNativ,,DLkPNNLLLDENGVLK,,,,,,,,,,,,,,,,2016-09-14
CDK9,200664,P50750,Cyclin-dependent kinase 9; cell division protein kinase 9; C-2k; CDC2L4; CDK9; CTK1; PITALRE; TAK,KiNativ,,DMkAANVLITR,,,,,,,,,,,,,,,,2016-09-14
CHK2,200666,O96017,Serine/threonine-protein kinase Chk2; CHK2 checkpoint homolog,KiNativ,,VAIkIISK,CHEK2,11200,,,,,,,,,,Homo sapiens,,,,2016-09-14
CSK,200669,P41240,Tyrosine-protein kinase CSK,KiNativ,,VSDFGLTkEASSTQDTGKLPVK,,,,,,,,,,,,,,,,2016-09-14
DNAPK,200674,P78527,DNA-dependent protein kinase catalytic subunit,KiNativ,,EHPFLVkGGEDLR,,,,,,,,,,,,,,,,2016-09-14
eEF2K,200677,O00418,Elongation factor 2 kinase,KiNativ,,YIkYNSNSGFVR,,,,,,,,,,,,,,,,2016-09-14
MK03,200681,P27361,Mitogen-activated protein kinase 3,KiNativ,,DLkPSNLLINTTCDLK,,,,,,,,,,,,,,,,2016-09-14
FAK,200683,Q05397,Focal adhesion kinase 1,KiNativ,,CIGEGQFGDVHQGIYMSPENPALAVAIkTCK,,,,,,,,,,,,,,,,2016-09-14
FER,200686,P16591,Proto-oncogene tyrosine-protein kinase FER,KiNativ,,TSVAVkTCKEDLPQELK,,,,,,,,,,,,,,,,2016-09-14
GCK,200689,Q12851,Mitogen-activated protein kinase kinase kinase kinase 2,KiNativ,,DTVTSELAAVkIVK,,,,,,,,,,,,,,,,2016-09-14
GSK3A,200693,P49840,Glycogen synthase kinase-3 alpha,KiNativ,,DIkPQNLLVDPDTAVLK,,,,,,,,,,,,,,,,2016-09-14
GSK3B,200694,P49841,Glycogen synthase kinase-3 beta,KiNativ,,DIkPQNLLLDPDTAVLK,,,,,,,,,,,,,,,,2016-09-14
"IKKE,TBK1",200697,Q14164,Inhibitor of nuclear factor kappa-B kinase subunit epsilon,KiNativ,,DIkPGNIMR,IKBKE,9641,,,,,,,,,,Homo sapiens,,,,2016-09-14
ILK,200699,Q13418,Integrin-linked protein kinase 1,KiNativ,,WQGNDIVVkVLK,,,,,,,,,,,,,,,,2016-09-14
IRAK1,200700,P51617,Interleukin-1 receptor-associated kinase 1,KiNativ,,AIQFLHQDSPSLIHGDIkSSNVLLDER,IRAK1,,,,,,,,,,,,,,,2016-09-14
IRAK4,200701,Q9NWZ3,Interleukin-1 receptor-associated kinase 4; IPD1; NY-REN-64; REN64,KiNativ,,DIkSANILLDEAFTAK,IRAK4,51135,,,,,,,,,,Homo sapiens,,,,2016-09-14
"JNK1,JNK2,JNK3",200707,P45983,Mitogen-activated protein kinase 8,KiNativ,,DLkPSNIVVK,,,,,,,,,,,,,,,,2016-09-14
KHS1,200710,Q9Y4K4,Mitogen-activated protein kinase kinase kinase kinase 5,KiNativ,,NVHTGELAAVkIIK,,,,,,,,,,,,,,,,2016-09-14
LATS1,200711,O95835,Serine/threonine-protein kinase LATS1,KiNativ,,ALYATkTLR,,,,,,,,,,,,,,,,2016-09-14
LKB1,200712,Q15831,Serine/threonine-protein kinase 11,KiNativ,,DIkPGNLLLTTGGTLK,,,,,,,,,,,,,,,,2016-09-14
LOK,200716,O94804,Serine/threonine-protein kinase 10,KiNativ,,NKETGALAAAkVIETK,STK10,,,,,,,,,,,,,,,2016-09-14
"MAP2K1,MAP2K2",200719,Q02750,Dual specificity mitogen-activated protein kinase kinase 1,KiNativ,,DVkPSNILVNSR,,,,,,,,,,,,,,,,2016-09-14
MAP2K3,200722,P46734,Dual specificity mitogen-activated protein kinase kinase 3,KiNativ,,DVkPSNVLINK,,,,,,,,,,,,,,,,2016-09-14
MAP2K4,200723,P45985,Dual specificity mitogen-activated protein kinase kinase 4,KiNativ,,MVHKPSGQIMAVkR,,,,,,,,,,,,,,,,2016-09-14
MAP2K5,200725,Q13163,Dual specificity mitogen-activated protein kinase kinase 5,KiNativ,,DVkPSNMLVNTR,,,,,,,,,,,,,,,,2016-09-14
MAP2K6,200726,P52564,Dual specificity mitogen-activated protein kinase kinase 6,KiNativ,,DVkPSNVLINALGQVK,,,,,,,,,,,,,,,,2016-09-14
MAP2K6,200728,P52564,Dual specificity mitogen-activated protein kinase kinase 6,KiNativ,,HVPSGQIMAVkR,,,,,,,,,,,,,,,,2016-09-14
MP2K7,200729,O14733,Dual specificity mitogen-activated protein kinase kinase 7,KiNativ,,DVkPSNILLDER,MAP2K7,5609,,,,,,,,,,Homo sapiens,,,,2016-09-14
MAP3K1,200730,Q13233,Mitogen-activated protein kinase kinase kinase 1,KiNativ,,DVkGANLLIDSTGQR,,,,,,,,,,,,,,,,2016-09-14
"M3K2,MAP3K3",200732,Q9Y2U5,Mitogen-activated protein kinase kinase kinase 2; MAP3K2; MEKK2; MEKK2/MAP3K2; MEKK2B,KiNativ,,DIkGANILR,MAP3K2,10746,,,,,,,,,,Homo sapiens,,,,2016-09-14
"MAP3K5,MAP3K6,MAP3K7",200735,Q99683,Mitogen-activated protein kinase kinase kinase 5,KiNativ,,IAIkEIPERDSR,,,,,,,,,,,,,,,,2016-09-14
MARK3,200740,P27448,MAP/microtubule affinity-regulating kinase 3,KiNativ,,EVAIKIIDkTQLNPTSLQK,,,,,,,,,,,,,,,,2016-09-14
MLK3,200746,Q16584,Mitogen-activated protein kinase kinase kinase 11,KiNativ,,DLkSNNILLLQPIESDDMEHK,,,,,,,,,,,,,,,,2016-09-14
MST1,200751,Q13043,Serine/threonine-protein kinase 4,KiNativ,,ETGQIVAIkQVPVESDLQEIIK,,,,,,,,,,,,,,,,2016-09-14
"MST1,MST2",200753,Q13043,Serine/threonine-protein kinase 4,KiNativ,,DIkAGNILLNTEGHAK,,,,,,,,,,,,,,,,2016-09-14
MST2,200755,Q13188,Serine/threonine-protein kinase 3,KiNativ,,ESGQVVAIkQVPVESDLQEIIK,,,,,,,,,,,,,,,,2016-09-14
"MST4,YSK1",200759,O00506,Serine/threonine-protein kinase 25,KiNativ,,DIkAANVLLSEQGDVK,,,,,,,,,,,,,,,,2016-09-14
NDR1,200760,Q15208,Serine/threonine-protein kinase 38,KiNativ,,DTGHVYAMkILR,,,,,,,,,,,,,,,,2016-09-14
NEK1,200767,Q96PY6,Serine/threonine-protein kinase Nek1,KiNativ,,DIkSQNIFLTK,,,,,,,,,,,,,,,,2016-09-14
"NEK6,NEK7",200768,Q9HC98,Serine/threonine-protein kinase Nek6,KiNativ,,DIkPANVFITATGVVK,,,,,,,,,,,,,,,,2016-09-14
NEK7,200770,Q8TDX7,Serine/threonine-protein kinase Nek7,KiNativ,,AACLLDGVPVALkK,,,,,,,,,,,,,,,,2016-09-14
NEK9,200773,Q8TD19,Serine/threonine-protein kinase Nek9,KiNativ,,TEDDSLVVWkEVDLTR,,,,,,,,,,,,,,,,2016-09-14
NEK9,200774,Q8TD19,Serine/threonine-protein kinase Nek9,KiNativ,,DIkTLNIFLTK,,,,,,,,,,,,,,,,2016-09-14
"p38d,p38g",200777,P53778,Mitogen-activated protein kinase 12,KiNativ,,DLkPGNLAVNEDCELK,,,,,,,,,,,,,,,,2016-09-14
KS6B1,200779,P23443,Ribosomal protein S6 kinase 1 (EC 2.7.1.37) (S6K) (S6K1) (70 kDa ribosomal protein S6 kinase 1) (p70 S6 kinase alpha) (p70(S6K)-alpha),KiNativ,,DLkPENIMLNHQGHVK,RPS6KB1,,,,,,,,,,,,,,,2016-09-14
CDK16,200783,Q00536,Cyclin-dependent kinase 16; Cell division protein kinase 16; Serine/threonine-protein kinase PCTAIRE-1; FLJ16665; PCTAIRE; PCTAIRE1; PCTGAIRE; PCTK1,KiNativ,,LTDNLVALkEIR,CDK16,5127,,,,,,,,,,Homo sapiens,,,,2016-09-14
PCTAIRE2,200784,Q00537,Serine/threonine-protein kinase PCTAIRE-2,KiNativ,,DLkPQNLLINEK,,,,,,,,,,,,,,,,2016-09-14
"PCTAIRE2,PCTAIRE3",200785,Q00537,Serine/threonine-protein kinase PCTAIRE-2,KiNativ,,SKLTENLVALkEIR,,,,,,,,,,,,,,,,2016-09-14
CDK14,200787,O94921,Cyclin-dependent kinase 14; serine/threonine-protein kinase PFTAIRE-1; PFTK1,KiNativ,,LVALkVIR,CDK14,5218,,,,,,,,,,Homo sapiens,,,,2016-09-14
PIP4K2A,200797,P48426,Phosphatidylinositol 5-phosphate 4-kinase type-2 alpha; 1-phosphatidylinositol 5-phosphate 4-kinase 2-alpha; Diphosphoinositide kinase 2-alpha; PIP5KIII,KiNativ,,AKELPTLkDNDFINEGQK,PIP4K2A,,,,,,,,,,,Homo sapiens,,,,2016-09-14
PI42C,200799,Q8TBX8,Phosphatidylinositol 5-phosphate 4-kinase type-2 gamma; FLJ22055; PIP4K2C; PIP5K2C,KiNativ,,TLVIkEVSSEDIADMHSNLSNYHQYIVK,PIP4K2C,79837,,,,,,,,,,Homo sapiens,,,,2016-09-14
FYV1,200800,Q9Y2I7,1-phosphatidylinositol 3-phosphate 5-kinase; PIKfyve,KiNativ,,GGkSGAAFYATEDDRFILK,PIKFYVE,200576,,,,,,,,,,,,,,2016-09-14
PKR,200809,P19525,"Interferon-induced, double-stranded RNA-activated protein kinase",KiNativ,,DLkPSNIFLVDTK,,,,,,,,,,,,,,,,2016-09-14
PLK1,200810,P53350,Serine/threonine-protein kinase PLK1; polo-like kinase 1 (Drosophila); PLK; PLK1; STPK13,KiNativ,,CFEISDADTKEVFAGkIVPK,PLK1,5347,,,,,,,,,,,,,,2016-09-14
PRPK,200812,Q96S44,TP53-regulating kinase,KiNativ,,FLSGLELVkQGAEAR,,,,,,,,,,,,,,,,2016-09-14
"RSK1,RSK2,RSK3_domain1",200815,Q15418,Ribosomal protein S6 kinase alpha 1; KS6A1,KiNativ,,DLkPENILLDEEGHIK,RPS6KA1,6195,,,,domain1,,,,,,,,,,2016-09-14
RSK2_domain2,200821,P51812,Ribosomal protein S6 kinase alpha 3; KS6A3; S6K-alpha-3; p90-RSK 3; MAPKAPK-1b; pp90RSK2,KiNativ,,DLkPSNILYVDESGNPESIR,RPS6KA3,6197,,,,domain2,,,,,,,,,,2016-09-14
SGK3,200826,Q96BR1,Serine/threonine-protein kinase Sgk3; Serum/glucocorticoid-regulated kinase 3; CISK; DKFZp781N0293; SGKL,KiNativ,,FYAVkVLQK,SGK3,23678,,,,,,,,,,Homo sapiens,,,,2016-09-14
SLK,200829,Q9H2G2,STE20-like serine/threonine-protein kinase; CTCL tumor antigen se20-9; bA16H23.1; KIAA0204; LOSK; MGC133067; se20-9; SLK; STK2,KiNativ,,DLkAGNILFTLDGDIK,SLK,9748,,,,,,,,,,,,,,2016-09-14
TLK2,200838,Q86UE8,Serine/threonine-protein kinase tousled-like 2; tousled-like kinase 2; MGC44450; PKU-ALPHA; TLK2,KiNativ,,YVAVkIHQLNK,TLK2,11011,,,,,,,,,,,,,,2016-09-14
"Wnk1,Wnk2,Wnk3",200842,Q9Y3S1,Serine/threonine-protein kinase WNK2,KiNativ,,DLkCDNIFITGPTGSVK,WNK2,65268,,,,,,,,,,Homo sapiens,,,,2016-09-14
"Wnk1,Wnk2,Wnk4",200843,Q9Y3S1,Serine/threonine-protein kinase WNK2,KiNativ,,IGDLGLATLkR,WNK2,65268,,,,,,,,,,Homo sapiens,,,,2016-09-14
MLTK,200845,Q9NYL2,Mitogen-activated protein kinase kinase kinase MLT; sterile alpha motif and leucine zipper containing kinase AZK; AZK; MLK7; mlklak; MLT; MLTK; MRK; pk; ZAK,KiNativ,,WISQDKEVAVKk,ZAK,51776,,,,,,,,,,,,,,2016-09-14
"ZC1/HGK,ZC2/TNIK,ZC3/MINK",200847,O95819,Mitogen-activated protein kinase kinase kinase kinase 4,KiNativ,,DIkGQNVLLTENAEVK,,,,,,,,,,,,,,,,2016-09-14
BTK,200881,Q06187,Tyrosine-protein kinase BTK; agammaglobulinemia tyrosine kinase; AGMX1; ATK; BPK,KiNativ,,YVLDDEYTSSVGSkFPVR,,,,,,,,,,,,,,,,2016-09-14
CAMK1D,200882,Q8IU85,Calcium/calmodulin-dependent protein kinase ID; CaM-K1; CAMK1D; CaMKID; CKLiK,KiNativ,,LFAVKCIPK,,,,,,,,,,,,,,,,2016-09-14
CDK5,200890,Q00535,Cyclin-dependent kinase 5; cell division protein kinase 5; PSSALRE,KiNativ,,DLkPQNLLINR,,,,,,,,,,,,,,,,2016-09-14
CHK2,200896,O96017,Serine/threonine-protein kinase Chk2; CHK2 checkpoint homolog,KiNativ,,DLkPENVLLSSQEEDCLIK,CHEK2,11200,,,,,,,,,,Homo sapiens,,,,2016-09-14
INSR,200935,P06213,Insulin receptor,KiNativ,,VAVKTVNESASLR,,,,,,,,,,,,,,,,2016-09-14
CRK7,200904,Q9NYV4,Cell division cycle 2-related protein kinase 7,KiNativ,,DIKCSNILLNNSGQIK,,,,,,,,,,,,,,,,2016-09-14
FES,200916,P07332,Proto-oncogene tyrosine-protein kinase Fes/Fps,KiNativ,,LRADNTLVAVkSCR,,,,,,,,,,,,,,,,2016-09-14
FGR,200918,P09769,Proto-oncogene tyrosine-protein kinase FGR,KiNativ,,LIKDDEYNPCQGSkFPIK,,,,,,,,,,,,,,,,2016-09-14
FRAP1,200921,P42345,FKBP12-rapamycin complex-associated protein,KiNativ,,IQSIAPSLQVITSKQRPR,,,,,,,,,,,,,,,,2016-09-14
HPK1,200928,Q92918,Mitogen-activated protein kinase kinase kinase kinase 1,KiNativ,,DKVSGDLVALkMVK,,,,,,,,,,,,,,,,2016-09-14
IKKB,200931,O14920,Inhibitor of nuclear factor kappa-B kinase subunit beta,KiNativ,,WHNQETGEQIAIKQCR,IKBKB,,,,,,,,,,,,,,,2016-09-14
IKKE,200933,Q14164,Inhibitor of nuclear factor kappa-B kinase subunit epsilon,KiNativ,,SGELVAVkVFNTTSYLRPR,IKBKE,9641,,,,,,,,,,Homo sapiens,,,,2016-09-14
"MARK3,MARK4",200949,P27448,MAP/microtubule affinity-regulating kinase 3,KiNativ,,EVAIkIIDK,,,,,,,,,,,,,,,,2016-09-14
MASTL,200950,Q96GX5,Microtubule-associated serine/threonine-protein kinase-like,KiNativ,,LYAVKVVK,,,,,,,,,,,,,,,,2016-09-14
NEK3,200960,P51956,Serine/threonine-protein kinase Nek3,KiNativ,,SKNIFLTQNGK,,,,,,,,,,,,,,,,2016-09-14
p38a,200965,Q15454,Protein-serine/threonine kinase,KiNativ,,DLKPSNLAVNEDCELK,,,,,,,,,,,,,,,,2016-09-14
MK14,200967,Q95NE7,Mitogen-activated protein kinase 14 [Pan troglodytes (Chimpanzee)],KiNativ,,QELNkTIWEVPER,,,,,,,,,,,,,,,,2016-09-14
PIK3CB,200976,P42338,"Phosphatidylinositol-4,5-bisphosphate 3-kinase, catalytic subunit beta; DKFZp779K1237; MGC133043; P110BETA; PI3K; PI3KBETA; PIK3C1; PIK3CB; PI3K-beta",KiNativ,,VFGEDSVGVIFkNGDDLR,PIK3CB,5291,,,,,,,,,,Homo sapiens,,,,2016-09-14
PIK3CD,200977,O00329,"Phosphatidylinositol-4,5-bisphosphate 3-kinase, catalytic subunit delta; p110D; P110DELTA; PI3K; PIK3CD; PI3K-delta",KiNativ,,VNWLAHNVSkDNRQ,PIK3CD,5293,,,,,,,,,,Homo sapiens,,,,2016-09-14
PIK3CG,200978,P48736,"Phosphatidylinositol-4,5-bisphosphate 3-kinase, catalytic subunit gamma; PI3CG; PI3K; PI3Kgamma; PIK3; PIK3CG",KiNativ,,KkPLWLEFK,PIK3CG,5294,,,,,,,,,,Homo sapiens,,,,2016-09-14
FAK2,200997,Q14289,Protein-tyrosine kinase 2-beta; CADTK; CAKB; FADK2; FAK2; PKB; PTK; PTK2B; PYK2; RAFTK,KiNativ,,YIEDEDYYkASVTR,PTK2B,2185,,,,,,,,,,,,,,2016-09-14
RSK1 (Domain 2),201005,Q15418,Ribosomal protein S6 kinase alpha 1; KS6A1,KiNativ,,ATNMEYAVKVIDK,RPS6KA1,6195,,,,domain2,,,,,,,,,,2016-09-14
SRPK1/2,201014,Q96SB4,Serine/threonine-protein kinase SRPK1,KiNativ,,FVAMKVVK,,,,,,,,,,,,,,,,2016-09-14
STLK6,201016,Q9C0K7,Serine/threonine-protein kinase ALS2CR2,KiNativ,,HTPTGTLVTIKITNLENCNEER,,,,,,,,,,,,,,,,2016-09-14
SYK,201017,P43405,Tyrosine-protein kinase SYK; spleen tyrosine kinase; p72-Syk; DKFZp313N1010; FLJ25043; FLJ37489; SYK,KiNativ,,TVAVkILK,SYK,6850,,,,,,,,,,Homo sapiens,,,,2016-09-14
ULK3,201026,Q6PHR2,Serine/threonine-protein kinase ULK3; Unc-51-like kinase 3 (C. elegans); DKFZp434C131; FLJ90566; ULK3,KiNativ,,EVVAIkCVAK,ULK3,25989,,,,,,,,,,,,,,2016-09-14
"CaMK2a,CaMK2b,CaMK2d,CaMK2g",201047,Q9UQM7,Calcium/calmodulin-dependent protein kinase II alpha; CAMK2A; CAMKA; KIAA0968,KiNativ,,DLkPENLLLASK,,,,,,,,,,,,,,,,2016-09-14
M4K3,201058,Q8IVH8,Mitogen-activated protein kinase kinase kinase kinase 3; GLK; KHS2; MAP4K3; MAPKKKK3; MEKKK3; RAB8IPL1,KiNativ,,NVNTGELAAIkVIK,MAP4K3,8491,,,,,,,,,,Homo sapiens,,,,2016-09-14
PDK1,201062,O15530,3-phosphoinositide-dependent protein kinase 1,KiNativ,,EYAIkILEK,,,,,,,,,,,,,,,,2016-09-14
PKD2,201064,Q9BZL6,Protein kinase D2,KiNativ,,DVAVkVIDK,,,,,,,,,,,,,,,,2016-09-14
RIPK3,201065,Q9Y572,Receptor-interacting serine/threonine-protein kinase 3,KiNativ,,DLkPSNVLLDPELHVK,RIPK3,,,,,,,,,,,,,,,2016-09-14
ULK1,201071,O75385,Serine/threonine-protein kinase ULK1; Unc-51-like kinase 1 (C. elegans); ATG1; FLJ38455; FLJ46475; ULK1; UNC51; Unc51.1,KiNativ,,DLkPQNILLSNPAGR,ULK1,8408,,,,,,,,,,,,,,2016-09-14
SNRK,201076,Q9NRH2,SNF-related serine/threonine-protein kinase; SNF1-related kinase; DKFZp779A1866; FLJ20224; HSNFRK; KIAA0096; SNRK,KiNativ,,DLkPENVVFFEK,SNRK,54861,,,,,,,,,,,,,,2016-09-14
AurA,201080,O14965,Serine/threonine-protein kinase 6,KiNativ,,FILALkVLFK,,,,,,,,,,,,,,,,2016-09-14
PKN1,201094,Q16512,Protein kinase N1,KiNativ,,VLLSEFRPSGELFAIkALK,,,,,,,,,,,,,,,,2016-09-14
CDK20,201168,Q8IZL9,Cyclin-dependent kinase 20; Cell cycle-related kinase; CCRK; CDCH,KiNativ,,DLkPANLLISASGQLK,CDK20,,,,,,,,,,,Homo sapiens,,,2014-06-26,2016-09-14
CDK16,201174,Q00536,Cyclin-dependent kinase 16; Cell division protein kinase 16; Serine/threonine-protein kinase PCTAIRE-1; FLJ16665; PCTAIRE; PCTAIRE1; PCTGAIRE; PCTK1,KiNativ,,DLkPQNLLINER,CDK16,5127,,,,,,,,,,Homo sapiens,,,2014-06-26,2016-09-14
CDK13,201178,Q14004,Cyclin-dependent kinase 13; Cell division cycle 2-like protein kinase 5; CHED,KiNativ,,DIKCSNILLNNR,CDK13,,,,,,,,,,,Homo sapiens,,,2014-06-26,2016-09-14
MK01,201192,P28482,Mitogen-activated protein kinase 1 [Homo sapiens],KiNativ,,DLKPSNLLLNTTCDLK,MAPK1,,,,,,,,,,,Homo sapiens,,,2014-06-26,2016-09-14
KC1G2,201209,P78368,"Casein kinase I isoform gamma-2; Casein kinase 1, gamma 2; CK1g2; CSNK1G2",KiNativ,,DVKPENFLVGRPGTK,CSNK1G2,1455,,,,,,,,,,Homo sapiens,,,2014-06-26,2016-09-14
"MARK1,MARK2",201231,Q7KZI7,Serine/threonine-protein kinase MARK2; MAP/microtubule affinity-regulating kinase 2; EMK1; EMK-1; MGC99619; PAR-1; Par1b,KiNativ,,EVAVKIIDK,MARK2,2011,,,,,,,,,,Homo sapiens,,,2014-06-26,2016-09-14
"MER,TYRO3",201236,Q12866,Proto-oncogene tyrosine-protein kinase MER precursor,KiNativ,,KIYSGDYYR,MERTK,,,,,,,,,,,Homo sapiens,,,2014-06-26,2016-09-14
SIK3,201266,Q9Y2K2,Serine/threonine-protein kinase SIK3; SIK family kinase 3; FLJ12240; KIAA0999; L19; QSK,KiNativ,,VAIkIIDKTQLDEENLKK,SIK3,23387,,,,,,,,,,Homo sapiens,,,2014-06-26,2016-09-14
