Name,HMS LINCS ID,UniProt ID,Alternative Names,Provider,Provider Catalog ID,Amino Acid Sequence,Gene Symbol,Gene ID,Protein Source,Mutation,Phosphlorylation State,Domain,Protein Description,Protein Purity,Protein Complex,Isoform,Protein Type,Source Organism,Reference,Comments,Date Publicly Available,Most Recent Update
ATR,200643,Q13535,Serine/threonine-protein kinase ATR,KiNativ,,FYIMMCkPK,,,,,,,,,,,,,,,,2016-09-14
NEK8,200771,Q86SG6,Serine/threonine-protein kinase Nek8,KiNativ,,DLkTQNILLDK,,,,,,,,,,,,,,,,2016-09-14
"ABL,ARG",200633,P00519,Proto-oncogene tyrosine-protein kinase ABL1,KiNativ,,LMTGDTYTAHAGAkFPIK,,,,,,,,,,,,,,,,2016-09-14
ACK,200635,Q07912,Activated CDC42 kinase 1,KiNativ,,TVSVAVKCLkPDVLSQPEAMDDFIR,,,,,,,,,,,,,,,,2016-09-14
"AMPKa1,AMPKa2",200639,Q13131,5'-AMP-activated protein kinase catalytic subunit alpha-1,KiNativ,,DLkPENVLLDAHMNAK,,,,,,,,,,,,,,,,2016-09-14
BRAF,200647,P15056,Serine/threonine-protein kinase B-raf; v-raf murine sarcoma viral oncogene homolog B1; BRAF1; RAFB1,KiNativ,,DLkSNNIFLHEDLTVK,,,,,,,,,,,,,,,,2016-09-14
CaMK1a,200648,Q14012,Calcium/calmodulin-dependent protein kinase I; CAMK1; CaMK1a; CAMKI; MGC120317; MGC120318,KiNativ,,LVAIkCIAK,,,,,,,,,,,,,,,,2016-09-14
CaMK2g,200650,Q13555,Calcium/calmodulin-dependent protein kinase type II gamma chain,KiNativ,,TSTQEYAAkIINTK,,,,,,,,,,,,,,,,2016-09-14
CASK,200653,O14936,Peripheral plasma membrane protein CASK,KiNativ,,ETGQQFAVkIVDVAK,,,,,,,,,,,,,,,,2016-09-14
CDC2,200654,P06493,Cell division control protein 2 homolog,KiNativ,,DLkPQNLLIDDKGTIK,,,,,,,,,,,,,,,,2016-09-14
"CDK11,CDK8",200656,P49336,Cell division protein kinase 8,KiNativ,,DLkPANILVMGEGPER,,,,,,,,,,,,,,,,2016-09-14
CDK2,200658,P24941,Cyclin-dependent kinase 2; p33 protein kinase,KiNativ,,DLkPQNLLINTEGAIK,,,,,,,,,,,,,,,,2016-09-14
CDK7,200663,P50613,Cyclin-dependent kinase 7; cell division protein kinase 7; CAK1; CDK7; CDKN7; MO15; p39MO15; STK1,KiNativ,,DLkPNNLLLDENGVLK,,,,,,,,,,,,,,,,2016-09-14
CDK9,200664,P50750,Cyclin-dependent kinase 9; cell division protein kinase 9; C-2k; CDC2L4; CDK9; CTK1; PITALRE; TAK,KiNativ,,DMkAANVLITR,,,,,,,,,,,,,,,,2016-09-14
KC1A,200667,P48729,Casein kinase I isoform alpha,KiNativ,,DIkPDNFLMGIGR,,,,,,,,,,,,,,,,2016-09-14
"CK1d,CK1e",200668,P48730,Casein kinase I isoform delta,KiNativ,,DVkPDNFLMGLGKK,,,,,,,,,,,,,,,,2016-09-14
CSK,200669,P41240,Tyrosine-protein kinase CSK,KiNativ,,VSDFGLTkEASSTQDTGKLPVK,,,,,,,,,,,,,,,,2016-09-14
DNAPK,200672,P78527,DNA-dependent protein kinase catalytic subunit,KiNativ,,kGGSWIQEINVAEK,,,,,,,,,,,,,,,,2016-09-14
DNAPK,200674,P78527,DNA-dependent protein kinase catalytic subunit,KiNativ,,EHPFLVkGGEDLR,,,,,,,,,,,,,,,,2016-09-14
eEF2K,200677,O00418,Elongation factor 2 kinase,KiNativ,,YIkYNSNSGFVR,,,,,,,,,,,,,,,,2016-09-14
EPHA2,200679,P29317,Ephrin type-A receptor 2,KiNativ,,VLEDDPEATYTTSGGkIPIR,,,,,,,,,,,,,,,,2016-09-14
MK03,200681,P27361,Mitogen-activated protein kinase 3,KiNativ,,DLkPSNLLINTTCDLK,,,,,,,,,,,,,,,,2016-09-14
FER,200686,P16591,Proto-oncogene tyrosine-protein kinase FER,KiNativ,,TSVAVkTCKEDLPQELK,,,,,,,,,,,,,,,,2016-09-14
"FYN,SRC,YES",200687,P06241,Proto-oncogene tyrosine-protein kinase Fyn,KiNativ,,QGAkFPIKWTAPEAALYGR,,,,,,,,,,,,,,,,2016-09-14
GCK,200690,Q12851,Mitogen-activated protein kinase kinase kinase kinase 2,KiNativ,,DIkGANLLLTLQGDVK,,,,,,,,,,,,,,,,2016-09-14
GCN2_domain2,200691,Q9P2K8,Eukaryotic translation initiation factor 2-alpha kinase 4,KiNativ,,DLkPVNIFLDSDDHVK,,,,,,domain2,,,,,,,,,,2016-09-14
GSK3A,200693,P49840,Glycogen synthase kinase-3 alpha,KiNativ,,DIkPQNLLVDPDTAVLK,,,,,,,,,,,,,,,,2016-09-14
GSK3B,200694,P49841,Glycogen synthase kinase-3 beta,KiNativ,,DIkPQNLLLDPDTAVLK,,,,,,,,,,,,,,,,2016-09-14
IKKA,200695,O15111,Inhibitor of nuclear factor kappa-B kinase subunit alpha,KiNativ,,DLkPENIVLQDVGGK,CHUK,,,,,,,,,,,,,,,2016-09-14
IKKB,200696,O14920,Inhibitor of nuclear factor kappa-B kinase subunit beta,KiNativ,,DLkPENIVLQQGEQR,IKBKB,,,,,,,,,,,,,,,2016-09-14
ILK,200699,Q13418,Integrin-linked protein kinase 1,KiNativ,,WQGNDIVVkVLK,,,,,,,,,,,,,,,,2016-09-14
IRAK1,200700,P51617,Interleukin-1 receptor-associated kinase 1,KiNativ,,AIQFLHQDSPSLIHGDIkSSNVLLDER,IRAK1,,,,,,,,,,,,,,,2016-09-14
IRAK4,200701,Q9NWZ3,Interleukin-1 receptor-associated kinase 4; IPD1; NY-REN-64; REN64,KiNativ,,DIkSANILLDEAFTAK,IRAK4,51135,,,,,,,,,,Homo sapiens,,,,2016-09-14
IRE1,200702,O75460,Serine/threonine-protein kinase/endoribonuclease IRE1,KiNativ,,DLkPHNILISMPNAHGK,,,,,,,,,,,,,,,,2016-09-14
ITPK1,200703,Q13572,Inositol-tetrakisphosphate 1-kinase,KiNativ,,ESIFFNSHNVSkPESSSVLTELDKIEGVFERPSDEVIR,,,,,,,,,,,,,,,,2016-09-14
JAK1,200704,P23458,Tyrosine-protein kinase JAK1,KiNativ,,QLASALSYLEDKDLVHGNVCTkNLLLAR,,,,,,,,,,,,,,,,2016-09-14
JAK1_domain2,200706,P23458,Tyrosine-protein kinase JAK1,KiNativ,,IGDFGLTkAIETDKEYYTVK,,,,,,domain2,,,,,,,,,,2016-09-14
"JNK1,JNK2,JNK3",200707,P45983,Mitogen-activated protein kinase 8,KiNativ,,DLkPSNIVVK,,,,,,,,,,,,,,,,2016-09-14
KHS1,200710,Q9Y4K4,Mitogen-activated protein kinase kinase kinase kinase 5,KiNativ,,NVHTGELAAVkIIK,,,,,,,,,,,,,,,,2016-09-14
LATS1,200711,O95835,Serine/threonine-protein kinase LATS1,KiNativ,,ALYATkTLR,,,,,,,,,,,,,,,,2016-09-14
LKB1,200712,Q15831,Serine/threonine-protein kinase 11,KiNativ,,DIkPGNLLLTTGGTLK,,,,,,,,,,,,,,,,2016-09-14
LOK,200714,O94804,Serine/threonine-protein kinase 10,KiNativ,,DLkAGNVLMTLEGDIR,STK10,,,,,,,,,,,,,,,2016-09-14
MAP2K1,200718,Q02750,Dual specificity mitogen-activated protein kinase kinase 1,KiNativ,,IMHRDVkPSNILVNSR,,,,,,,,,,,,,,,,2016-09-14
"MAP2K1,MAP2K2",200719,Q02750,Dual specificity mitogen-activated protein kinase kinase 1,KiNativ,,DVkPSNILVNSR,,,,,,,,,,,,,,,,2016-09-14
MAP2K3,200722,P46734,Dual specificity mitogen-activated protein kinase kinase 3,KiNativ,,DVkPSNVLINK,,,,,,,,,,,,,,,,2016-09-14
MAP2K4,200724,P45985,Dual specificity mitogen-activated protein kinase kinase 4,KiNativ,,DIkPSNILLDR,,,,,,,,,,,,,,,,2016-09-14
MAP2K6,200726,P52564,Dual specificity mitogen-activated protein kinase kinase 6,KiNativ,,DVkPSNVLINALGQVK,,,,,,,,,,,,,,,,2016-09-14
MP2K7,200729,O14733,Dual specificity mitogen-activated protein kinase kinase 7,KiNativ,,DVkPSNILLDER,MAP2K7,5609,,,,,,,,,,Homo sapiens,,,,2016-09-14
MAP3K1,200730,Q13233,Mitogen-activated protein kinase kinase kinase 1,KiNativ,,DVkGANLLIDSTGQR,,,,,,,,,,,,,,,,2016-09-14
M3K2,200731,Q9Y2U5,Mitogen-activated protein kinase kinase kinase 2; MAP3K2; MEKK2; MEKK2/MAP3K2; MEKK2B,KiNativ,,ELAVkQVQFDPDSPETSKEVNALECEIQLLK,MAP3K2,10746,,,,,,,,,,Homo sapiens,,,,2016-09-14
"M3K2,MAP3K3",200732,Q9Y2U5,Mitogen-activated protein kinase kinase kinase 2; MAP3K2; MEKK2; MEKK2/MAP3K2; MEKK2B,KiNativ,,DIkGANILR,MAP3K2,10746,,,,,,,,,,Homo sapiens,,,,2016-09-14
MAP3K4,200734,Q9Y6R4,Mitogen-activated protein kinase kinase kinase 4,KiNativ,,DIkGANIFLTSSGLIK,,,,,,,,,,,,,,,,2016-09-14
"MAP3K7,TAK1",200736,O43318,Mitogen-activated protein kinase kinase kinase 7,KiNativ,,DLkPPNLLLVAGGTVLK,,,,,,,,,,,,,,,,2016-09-14
"MARK2,MARK3",200739,P27448,MAP/microtubule affinity-regulating kinase 3,KiNativ,,DLkAENLLLDADMNIK,,,,,,,,,,,,,,,,2016-09-14
MARK3,200740,P27448,MAP/microtubule affinity-regulating kinase 3,KiNativ,,EVAIKIIDkTQLNPTSLQK,,,,,,,,,,,,,,,,2016-09-14
MAST3,200743,O60307,Microtubule-associated serine/threonine-protein kinase 3,KiNativ,,DLkPDNLLITSLGHIK,,,,,,,,,,,,,,,,2016-09-14
MASTL,200744,Q96GX5,Microtubule-associated serine/threonine-protein kinase-like,KiNativ,,GAFGkVYLGQK,,,,,,,,,,,,,,,,2016-09-14
MLK3,200746,Q16584,Mitogen-activated protein kinase kinase kinase 11,KiNativ,,DLkSNNILLLQPIESDDMEHK,,,,,,,,,,,,,,,,2016-09-14
MLKL,200747,Q8NB16,"CDNA FLJ34389 fis, clone HCHON2000087",KiNativ,,APVAIkVFK,,,,,,,,,,,,,,,,2016-09-14
MSK1_domain1,200750,O75582,Ribosomal protein S6 kinase alpha 5,KiNativ,,DIkLENILLDSNGHVVLTDFGLSK,,,,,,domain1,,,,,,,,,,2016-09-14
MST1,200751,Q13043,Serine/threonine-protein kinase 4,KiNativ,,ETGQIVAIkQVPVESDLQEIIK,,,,,,,,,,,,,,,,2016-09-14
MST2,200755,Q13188,Serine/threonine-protein kinase 3,KiNativ,,ESGQVVAIkQVPVESDLQEIIK,,,,,,,,,,,,,,,,2016-09-14
MST3,200756,Q9Y6E0,Serine/threonine-protein kinase 24,KiNativ,,DIkAANVLLSEHGEVK,,,,,,,,,,,,,,,,2016-09-14
"MST4,YSK1",200759,O00506,Serine/threonine-protein kinase 25,KiNativ,,DIkAANVLLSEQGDVK,,,,,,,,,,,,,,,,2016-09-14
NDR1,200761,Q15208,Serine/threonine-protein kinase 38,KiNativ,,DIkPDNLLLDSK,,,,,,,,,,,,,,,,2016-09-14
NDR2,200765,Q9Y2H1,Serine/threonine-protein kinase 38-like,KiNativ,,DIkPDNLLLDAK,,,,,,,,,,,,,,,,2016-09-14
NEK1,200767,Q96PY6,Serine/threonine-protein kinase Nek1,KiNativ,,DIkSQNIFLTK,,,,,,,,,,,,,,,,2016-09-14
"NEK6,NEK7",200768,Q9HC98,Serine/threonine-protein kinase Nek6,KiNativ,,DIkPANVFITATGVVK,,,,,,,,,,,,,,,,2016-09-14
NEK7,200770,Q8TDX7,Serine/threonine-protein kinase Nek7,KiNativ,,AACLLDGVPVALkK,,,,,,,,,,,,,,,,2016-09-14
NEK9,200774,Q8TD19,Serine/threonine-protein kinase Nek9,KiNativ,,DIkTLNIFLTK,,,,,,,,,,,,,,,,2016-09-14
OSR1,200776,O95747,Serine/threonine-protein kinase OSR1; oxidative-stress responsive 1; KIAA1101; OSR1; OXSR1,KiNativ,,DVkAGNILLGEDGSVQIADFGVSAFLATGGDITR,OXSR1,9943,,,,,,,,,,,,,,2016-09-14
"p38d,p38g",200777,P53778,Mitogen-activated protein kinase 12,KiNativ,,DLkPGNLAVNEDCELK,,,,,,,,,,,,,,,,2016-09-14
KS6B1,200779,P23443,Ribosomal protein S6 kinase 1 (EC 2.7.1.37) (S6K) (S6K1) (70 kDa ribosomal protein S6 kinase 1) (p70 S6 kinase alpha) (p70(S6K)-alpha),KiNativ,,DLkPENIMLNHQGHVK,RPS6KB1,,,,,,,,,,,,,,,2016-09-14
"PCTAIRE2,PCTAIRE3",200785,Q00537,Serine/threonine-protein kinase PCTAIRE-2,KiNativ,,SKLTENLVALkEIR,,,,,,,,,,,,,,,,2016-09-14
CDK14,200787,O94921,Cyclin-dependent kinase 14; serine/threonine-protein kinase PFTAIRE-1; PFTK1,KiNativ,,LVALkVIR,CDK14,5218,,,,,,,,,,Homo sapiens,,,,2016-09-14
PHKg2,200788,P15735,"Phosphorylase b kinase gamma catalytic chain, testis/liver isoform",KiNativ,,ATGHEFAVkIMEVTAER,,,,,,,,,,,,,,,,2016-09-14
"PI4KA,PI4KAP2",200789,P42356,Phosphatidylinositol 4-kinase alpha,KiNativ,,SGTPMQSAAkAPYLAK,,,,,,,,,,,,,,,,2016-09-14
PI4KB,200790,Q9UBF8,Phosphatidylinositol 4-kinase beta,KiNativ,,VPHTQAVVLNSkDK,,,,,,,,,,,,,,,,2016-09-14
PIK3C3,200793,Q8NEB9,Phosphatidylinositol 3-kinase catalytic subunit type 3,KiNativ,,TEDGGKYPVIFkHGDDLR,PIK3C3,5289,,,,,,,,,,,,,,2016-09-14
PIP4K2A,200797,P48426,Phosphatidylinositol 5-phosphate 4-kinase type-2 alpha; 1-phosphatidylinositol 5-phosphate 4-kinase 2-alpha; Diphosphoinositide kinase 2-alpha; PIP5KIII,KiNativ,,AKELPTLkDNDFINEGQK,PIP4K2A,,,,,,,,,,,Homo sapiens,,,,2016-09-14
PI42C,200799,Q8TBX8,Phosphatidylinositol 5-phosphate 4-kinase type-2 gamma; FLJ22055; PIP4K2C; PIP5K2C,KiNativ,,TLVIkEVSSEDIADMHSNLSNYHQYIVK,PIP4K2C,79837,,,,,,,,,,Homo sapiens,,,,2016-09-14
FYV1,200800,Q9Y2I7,1-phosphatidylinositol 3-phosphate 5-kinase; PIKfyve,KiNativ,,GGkSGAAFYATEDDRFILK,PIKFYVE,200576,,,,,,,,,,,,,,2016-09-14
PITSLRE,200801,P21127,PITSLRE serine/threonine-protein kinase CDC2L1,KiNativ,,DLkTSNLLLSHAGILK,,,,,,,,,,,,,,,,2016-09-14
PKN2,200808,Q16513,Protein kinase N2,KiNativ,,DLkLDNLLLDTEGFVK,,,,,,,,,,,,,,,,2016-09-14
PKR,200809,P19525,"Interferon-induced, double-stranded RNA-activated protein kinase",KiNativ,,DLkPSNIFLVDTK,,,,,,,,,,,,,,,,2016-09-14
PLK1,200810,P53350,Serine/threonine-protein kinase PLK1; polo-like kinase 1 (Drosophila); PLK; PLK1; STPK13,KiNativ,,CFEISDADTKEVFAGkIVPK,PLK1,5347,,,,,,,,,,,,,,2016-09-14
PRPK,200812,Q96S44,TP53-regulating kinase,KiNativ,,FLSGLELVkQGAEAR,,,,,,,,,,,,,,,,2016-09-14
"RSK1,RSK2,RSK3_domain1",200815,Q15418,Ribosomal protein S6 kinase alpha 1; KS6A1,KiNativ,,DLkPENILLDEEGHIK,RPS6KA1,6195,,,,domain1,,,,,,,,,,2016-09-14
RSK1_domain2,200819,Q15418,Ribosomal protein S6 kinase alpha 1; KS6A1,KiNativ,,DLkPSNILYVDESGNPECLR,RPS6KA1,6195,,,,domain2,,,,,,,,,,2016-09-14
RSK2_domain2,200821,P51812,Ribosomal protein S6 kinase alpha 3; KS6A3; S6K-alpha-3; p90-RSK 3; MAPKAPK-1b; pp90RSK2,KiNativ,,DLkPSNILYVDESGNPESIR,RPS6KA3,6197,,,,domain2,,,,,,,,,,2016-09-14
RSKL1_domain1,200825,Q96S38,Ribosomal protein S6 kinase delta-1,KiNativ,,VLGVIDkVLLVMDTR,RPS6KC1,,,,,domain1,,,,,,,,,,2016-09-14
SGK3,200826,Q96BR1,Serine/threonine-protein kinase Sgk3; Serum/glucocorticoid-regulated kinase 3; CISK; DKFZp781N0293; SGKL,KiNativ,,FYAVkVLQK,SGK3,23678,,,,,,,,,,Homo sapiens,,,,2016-09-14
SLK,200829,Q9H2G2,STE20-like serine/threonine-protein kinase; CTCL tumor antigen se20-9; bA16H23.1; KIAA0204; LOSK; MGC133067; se20-9; SLK; STK2,KiNativ,,DLkAGNILFTLDGDIK,SLK,9748,,,,,,,,,,,,,,2016-09-14
SMG1,200830,Q96Q15,Serine/threonine-protein kinase SMG1,KiNativ,,DTVTIHSVGGTITILPTkTKPK,SMG1,,,,,,,,,,,Homo sapiens,,,,2016-09-14
STLK5,200833,Q7RTN6,STE20-related adaptor protein,KiNativ,,YSVkVLPWLSPEVLQQNLQGYDAK,,,,,,,,,,,,,,,,2016-09-14
"TAO1,TAOK3",200834,Q9H2K8,Serine/threonine-protein kinase TAO3; TAO kinase 3; DKFZp666H245; DPK; FLJ31808; JIK; MAP3K18; TAO3,KiNativ,,DIkAGNILLTEPGQVK,TAOK3,51347,,,,,,,,,,Homo sapiens,,,,2016-09-14
TAOK2,200835,Q9UL54,Serine/threonine-protein kinase TAO2; prostate-derived sterile 20-like kinase 1; hKFC-C; KIAA0881; MAP3K17; PSK; PSK1; PSK1-BETA; TAO2; TAOK2,KiNativ,,DVkAGNILLSEPGLVK,TAOK2,9344,,,,,,,,,,,,,,2016-09-14
TBK1,200836,Q9UHD2,Serine/threonine-protein kinase TBK1; TANK-binding kinase 1; NF-kappa-B-activating kinase; FLJ11330; NAK; T2K; TBK1,KiNativ,,TGDLFAIkVFNNISFLRPVDVQMR,TBK1,29110,,,,,,,,,,,,,,2016-09-14
TLK1,200837,Q9UKI8,Serine/threonine-protein kinase tousled-like 1; tousled-like kinase 1; KIAA0137; PKU-beta; TLK1,KiNativ,,YLNEIKPPIIHYDLkPGNILLVDGTACGEIK,TLK1,9874,,,,,,,,,,,,,,2016-09-14
ULK3,200839,Q6PHR2,Serine/threonine-protein kinase ULK3; Unc-51-like kinase 3 (C. elegans); DKFZp434C131; FLJ90566; ULK3,KiNativ,,NISHLDLkPQNILLSSLEKPHLK,ULK3,25989,,,,,,,,,,,,,,2016-09-14
"Wnk1,Wnk2,Wnk3",200842,Q9Y3S1,Serine/threonine-protein kinase WNK2,KiNativ,,DLkCDNIFITGPTGSVK,WNK2,65268,,,,,,,,,,Homo sapiens,,,,2016-09-14
MLTK,200845,Q9NYL2,Mitogen-activated protein kinase kinase kinase MLT; sterile alpha motif and leucine zipper containing kinase AZK; AZK; MLK7; mlklak; MLT; MLTK; MRK; pk; ZAK,KiNativ,,WISQDKEVAVKk,ZAK,51776,,,,,,,,,,,,,,2016-09-14
"ZC1/HGK,ZC2/TNIK,ZC3/MINK",200847,O95819,Mitogen-activated protein kinase kinase kinase kinase 4,KiNativ,,DIkGQNVLLTENAEVK,,,,,,,,,,,,,,,,2016-09-14
CAMK1D,200882,Q8IU85,Calcium/calmodulin-dependent protein kinase ID; CaM-K1; CAMK1D; CaMKID; CKLiK,KiNativ,,LFAVKCIPK,,,,,,,,,,,,,,,,2016-09-14
CDK5,200890,Q00535,Cyclin-dependent kinase 5; cell division protein kinase 5; PSSALRE,KiNativ,,DLkPQNLLINR,,,,,,,,,,,,,,,,2016-09-14
CHK1,200895,O14757,Serine/threonine-protein kinase Chk1; CHK1 checkpoint homolog,KiNativ,,DIkPENLLLDER,,,,,,,,,,,,,,,,2016-09-14
CHK2,200896,O96017,Serine/threonine-protein kinase Chk2; CHK2 checkpoint homolog,KiNativ,,DLkPENVLLSSQEEDCLIK,CHEK2,11200,,,,,,,,,,Homo sapiens,,,,2016-09-14
CLK3,200902,P49761,Dual specificity protein kinase CLK3; CDC-like kinase 3; CLK3; FLJ22858; PHCLK3; PHCLK3/152,KiNativ,,YEIVGNLGEGTFGKVVECLDHAR,,,,,,,,,,,,,,,,2016-09-14
CRK7,200904,Q9NYV4,Cell division cycle 2-related protein kinase 7,KiNativ,,DIKCSNILLNNSGQIK,,,,,,,,,,,,,,,,2016-09-14
EPHB4,200911,P54760,Ephrin type-B receptor 4; EPHB4; HTK; MYK1; TYRO11,KiNativ,,FLEENSSDPTYTSSLGGKIPIR,,,,,,,,,,,,,,,,2016-09-14
FRAP1,200921,P42345,FKBP12-rapamycin complex-associated protein,KiNativ,,IQSIAPSLQVITSKQRPR,,,,,,,,,,,,,,,,2016-09-14
IKKE,200933,Q14164,Inhibitor of nuclear factor kappa-B kinase subunit epsilon,KiNativ,,SGELVAVkVFNTTSYLRPR,IKBKE,9641,,,,,,,,,,Homo sapiens,,,,2016-09-14
MAP3K5,200944,Q99683,Mitogen-activated protein kinase kinase,KiNativ,,DIKGDNVLINTYSGVLK,,,,,,,,,,,,,,,,2016-09-14
"MARK3,MARK4",200949,P27448,MAP/microtubule affinity-regulating kinase 3,KiNativ,,EVAIkIIDK,,,,,,,,,,,,,,,,2016-09-14
MASTL,200950,Q96GX5,Microtubule-associated serine/threonine-protein kinase-like,KiNativ,,LYAVKVVK,,,,,,,,,,,,,,,,2016-09-14
MET,200951,P08581,Hepatocyte growth factor receptor; AUTS9; c-Met; HGFR; MET; RCCP2,KiNativ,,DMYDKEYYSVHNK,MET,4233,,,,,,,,,,,,,,2016-09-14
MST4,200958,Q9P289,Serine/threonine-protein kinase MST4,KiNativ,,TQQVVAIkIIDLEEAEDEIEDIQQEITVLSQCDSSYVTK,,,,,,,,,,,,,,,,2016-09-14
NEK3,200960,P51956,Serine/threonine-protein kinase Nek3,KiNativ,,SKNIFLTQNGK,,,,,,,,,,,,,,,,2016-09-14
NEK4,200961,P51957,Serine/threonine-protein kinase Nek4,KiNativ,,DLKTQNVFLTR,,,,,,,,,,,,,,,,2016-09-14
p38a,200965,Q15454,Protein-serine/threonine kinase,KiNativ,,DLKPSNLAVNEDCELK,,,,,,,,,,,,,,,,2016-09-14
PAN3,200969,Q58A45,PAB-dependent poly(A)-specific ribonuclease subunit 3,KiNativ,,VMDPTKILITGK,,,,,,,,,,,,,,,,2016-09-14
PEK,200973,Q9NZJ5,Eukaryotic translation initiation factor,KiNativ,,DLKPSNIFFTMDDVVK,,,,,,,,,,,,,,,,2016-09-14
PKD3,200988,O94806,Protein kinase D3,KiNativ,,DVAIKVIDK,,,,,,,,,,,,,,,,2016-09-14
RIPK1,200999,Q13546,Receptor-interacting serine/threonine-protein kinase 1; FLJ39204; RIP; RIP1; RIPK1,KiNativ,,DLKPENILVDNDFHIk,RIPK1,8737,,,,,,,,,,,,,,2016-09-14
RON,201003,Q04912,Macrophage-stimulating protein receptor,KiNativ,,IQCAIKSLSR,MST1R,,,,,,,,,,,,,,,2016-09-14
SRPK1,201013,Q96SB4,SRSF protein kinase 1; SFRS protein kinase 1; Serine/arginine-rich protein-specific kinase 1; SFRSK1,KiNativ,,IIHTDIKPENILLSVNEQYIR,SRPK1,6732,,,,,,,,,,,,,,2016-09-14
SRPK1/2,201014,Q96SB4,Serine/threonine-protein kinase SRPK1,KiNativ,,FVAMKVVK,,,,,,,,,,,,,,,,2016-09-14
TLK1/2,201022,Q86UE8,Serine/threonine-protein kinase tousled-like 2,KiNativ,,YLNEIKPPIIHYDLKPGNILLVNGTACGEIK,,,,,,,,,,,,,,,,2016-09-14
TNK1,201024,Q13470,Non-receptor tyrosine-protein kinase TNK1; MGC46193; TNK1,KiNativ,,SVPVAVKSLR,TNK1,8711,,,,,,,,,,,,,,2016-09-14
EGFR,201035,P00533,Epidermal growth factor receptor precursor,KiNativ,,LLGAEEKEYHAEGGkVPIK,,,,,,,,,,,,,,,,2016-09-14
LATS2,201037,Q9NRM7,Serine/threonine-protein kinase LATS2,KiNativ,,DIkPDNILIDLDGHIK,,,,,,,,,,,,,,,,2016-09-14
PRP4,201043,Q13523,Serine/threonine-protein kinase PRP4 homolog,KiNativ,,CNILHADIkPDNILVNESK,,,,,,,,,,,,,,,,2016-09-14
RSK1 domain1,201045,Q15418,Ribosomal protein S6 kinase alpha 1; KS6A1,KiNativ,,DLKPENILLDEEGHIkLTDFGLSKEAIDHEK,RPS6KA1,6195,,,,domain1,,,,,,,,,,2016-09-14
EphA1,201051,P21709,Ephrin type-A receptor 1 precursor,KiNativ,,LLDDFDGTYETQGGkIPIR,,,,,,,,,,,,,,,,2016-09-14
EPHB2,201054,P29323,Ephrin type-B receptor 2; CAPB; DRT; EK5; EPHB2; EPHT3; ERK; Hek5; MGC87492; PCBC; Tyro5,KiNativ,,FLEDDTSDPTYTSALGGkIPIR,,,,,,,,,,,,,,,,2016-09-14
M4K3,201058,Q8IVH8,Mitogen-activated protein kinase kinase kinase kinase 3; GLK; KHS2; MAP4K3; MAPKKKK3; MEKKK3; RAB8IPL1,KiNativ,,NVNTGELAAIkVIK,MAP4K3,8491,,,,,,,,,,Homo sapiens,,,,2016-09-14
PKD2,201064,Q9BZL6,Protein kinase D2,KiNativ,,DVAVkVIDK,,,,,,,,,,,,,,,,2016-09-14
SYK,201069,P43405,Tyrosine-protein kinase SYK; spleen tyrosine kinase; p72-Syk; DKFZp313N1010; FLJ25043; FLJ37489; SYK,KiNativ,,ISDFGLSkALR,SYK,6850,,,,,,,,,,Homo sapiens,,,,2016-09-14
ULK1,201071,O75385,Serine/threonine-protein kinase ULK1; Unc-51-like kinase 1 (C. elegans); ATG1; FLJ38455; FLJ46475; ULK1; UNC51; Unc51.1,KiNativ,,DLkPQNILLSNPAGR,ULK1,8408,,,,,,,,,,,,,,2016-09-14
AurB,201072,Q96GD4,Serine/threonine-protein kinase 12,KiNativ,,SHFIVALkVLFK,,,,,,,,,,,,,,,,2016-09-14
CLK2,201073,P49760,Dual specificity protein kinase CLK2; CDC-like kinase 2; CLK2; hCLK2; MGC61500,KiNativ,,LTHTDLkPENILFVNSDYELTYNLEK,,,,,,,,,,,,,,,,2016-09-14
SNRK,201076,Q9NRH2,SNF-related serine/threonine-protein kinase; SNF1-related kinase; DKFZp779A1866; FLJ20224; HSNFRK; KIAA0096; SNRK,KiNativ,,DLkPENVVFFEK,SNRK,54861,,,,,,,,,,,,,,2016-09-14
AurA,201080,O14965,Serine/threonine-protein kinase 6,KiNativ,,FILALkVLFK,,,,,,,,,,,,,,,,2016-09-14
"MLK1,MLKL",201087,P80192,Mitogen-activated protein kinase kinase kinase 9,KiNativ,,DLkSSNILILQK,,,,,,,,,,,,,,,,2016-09-14
MSK2 domain1,201090,O75676,Ribosomal protein S6 kinase alpha 4,KiNativ,,DLkLENVLLDSEGHIVLTDFGLSK,,,,,,domain1,,,,,,,,,,2016-09-14
PHKg1,201092,Q16816,"Phosphorylase b kinase gamma catalytic chain, skeletal muscle isoform",KiNativ,,DLkPENILLDDNMNIK,,,,,,,,,,,,,,,,2016-09-14
PKN1,201094,Q16512,Protein kinase N1,KiNativ,,VLLSEFRPSGELFAIkALK,,,,,,,,,,,,,,,,2016-09-14
KCC4,201167,Q16566,Calcium/calmodulin-dependent protein kinase type IV; CAMK4; CaMK-GR; MGC36771,KiNativ,,DLKPENLLYATPAPDAPLK,CAMK4,,,,,,,,,,,Homo sapiens,,,2014-06-26,2016-09-14
CDK20,201168,Q8IZL9,Cyclin-dependent kinase 20; Cell cycle-related kinase; CCRK; CDCH,KiNativ,,DLkPANLLISASGQLK,CDK20,,,,,,,,,,,Homo sapiens,,,2014-06-26,2016-09-14
CDK13,201178,Q14004,Cyclin-dependent kinase 13; Cell division cycle 2-like protein kinase 5; CHED,KiNativ,,DIKCSNILLNNR,CDK13,,,,,,,,,,,Homo sapiens,,,2014-06-26,2016-09-14
EPHB3,201187,P54753,Ephrin type-B receptor 3; EPHB3; ETK2; HEK2; TYRO6,KiNativ,,FLEDDPSDPTYTSSLGGKIPIR,EPHB3,,,,,,,,,,,Homo sapiens,,,2014-06-26,2016-09-14
ERBB3,201189,P21860,Receptor tyrosine-protein kinase erbB-3; Proto-oncogene-like protein c-ErbB-3; HER3,KiNativ,,GVWIPEGESIKIPVCIkVIEDK,ERBB3,2065,,,,,,,,,,Homo sapiens,,,2014-06-26,2016-09-14
MK01,201192,P28482,Mitogen-activated protein kinase 1 [Homo sapiens],KiNativ,,DLKPSNLLLNTTCDLK,MAPK1,,,,,,,,,,,Homo sapiens,,,2014-06-26,2016-09-14
FRK,201197,P42685,Tyrosine-protein kinase FRK; Fyn-related kinase; FRK; GTK; PTK5; RAK,KiNativ,,HEIKLPVK,FRK,2444,,,,,,,,,,Homo sapiens,,,2014-06-26,2016-09-14
GPRK5,201199,P34947,G protein-coupled receptor kinase 5,KiNativ,,DLKPENILLDDYGHIR,,,,,,,,,,,,Homo sapiens,,,2014-06-26,2016-09-14
KC1G2,201209,P78368,"Casein kinase I isoform gamma-2; Casein kinase 1, gamma 2; CK1g2; CSNK1G2",KiNativ,,DVKPENFLVGRPGTK,CSNK1G2,1455,,,,,,,,,,Homo sapiens,,,2014-06-26,2016-09-14
KCC2D,201210,Q13557,Calcium/calmodulin-dependent protein kinase type II subunit delta; CaM kinase II subunit delta; CAMK2D; CAMKD; DKFZp686G23119; DKFZp686I2288; MGC44911,KiNativ,,IPTGQEYAAKIINTKK,CAMK2D,817,,,,,,,,,,Homo sapiens,,,2014-06-26,2016-09-14
M3K6,201230,O95382,Mitogen-activated protein kinase kinase kinase 6; ASK2; MAP3K6; MAPKKK6; MEKK6; MEKK6/MAP3K6; MGC125653; MGC20114,KiNativ,,DIKGDNVLINTFSGLLK,MAP3K6,,,,,,,,,,,Homo sapiens,,,2014-06-26,2016-09-14
MARK4,201233,Q96L34,MAP/microtubule affinity-regulating kinase 4; FLJ90097; KIAA1860; MARKL1; Nbla00650,KiNativ,,DLKAENLLLDAEANIK,MARK4,57787,,,,,,,,,,Homo sapiens,,,2014-06-26,2016-09-14
MK09,201237,P45984,Mitogen-activated protein kinase 9; JNK2; JNK2A; JNK2ALPHA; JNK2B; JNK2BETA; JNK-55; MAPK9; p54a; p54aSAPK; PRKM9; SAPK,KiNativ,,YQQLKPIGSGAQGIVCAAFDTVLGINVAVKK,MAPK9,5601,,,,,,,,,,Homo sapiens,,,2014-06-26,2016-09-14
NEK2,201243,P51955,Serine/threonine-protein kinase Nek2; NIMA (never in mitosis gene a)-related kinase 2; HsPK21; NEK2; NEK2A; NLK1,KiNativ,,DLKPANVFLDGK,NEK2,4751,,,,,,,,,,Homo sapiens,,,2014-06-26,2016-09-14
NUAK1,201248,O60285,"NUAK family, SNF1-like kinase, 1; ARK5; KIAA0537; NUAK1",KiNativ,,LVAIkSIR,NUAK1,9891,,,,,,,,,,Homo sapiens,,,2014-06-26,2016-09-14
P4K2B,201254,Q8TCG2,Phosphatidylinositol 4-kinase type 2-beta,KiNativ,,SEEPYGQLNPKWTK,PI4K2B,,,,,,,,,,,Homo sapiens,,,2014-06-26,2016-09-14
PKMYT1,201258,Q99640,"Membrane-associated tyrosine- and threonine-specific cdc2-inhibitory kinase; Protein kinase, membrane associated tyrosine/threonine 1; DKFZp547K1610; FLJ20093; MYT1",KiNativ,,DTLLALAHLHSQGLVHLDVKPANIFLGPR,PKMYT1,9088,,,,,,,,,,Homo sapiens,,,2014-06-26,2016-09-14
RSK2 domain1,201262,P51812,Ribosomal protein S6 kinase alpha 3,KiNativ,,DLKPENILLDEEGHIKLTDFGLSKESIDHEK,RPS6KA3,,,,,domain1,,,,,,Homo sapiens,,,2014-06-26,2016-09-14
SGK1,201263,O00141,Serine/threonine-protein kinase Sgk1; serum/glucocorticoid regulated kinase 1; SGK,KiNativ,,HKAEEVFYAVKVLQK,SGK1,,,,,,,,,,,Homo sapiens,,,2014-06-26,2016-09-14
TYK2(Kin.Dom.2),201276,P29597,Non-receptor tyrosine-protein kinase TYK2; Tyrosine kinase 2; JTK1; TYK2,KiNativ,,IGDFGLAkAVPEGHEYYR,TYK2,7297,,,,Kin.Dom.2,,,,,,Homo sapiens,,,2014-06-26,2016-09-14