HMS LINCS Batch ID,HMS LINCS ID,Name,Alternative Names,LINCS ID,PubChem CID,ChEBI ID,ChEMBL ID,Molecular Mass,InChi,InChi Key,SMILES,Relevant Citations,Comments,Provider,Provider Batch ID,Molecular Weight,Purity,Purification Method,Chemical Synthesis Reference,Date Publicly Available,Most Recent Update
10006-101-1,10006,AZD7762,,LSM-1006,67077825,,,362.12,"InChI=1S/C17H19FN4O2S/c18-11-4-1-3-10(7-11)14-8-13(22-17(19)24)15(25-14)16(23)21-12-5-2-6-20-9-12/h1,3-4,7-8,12,20H,2,5-6,9H2,(H,21,23)(H3,19,22,24)/t12-/m1/s1",IAYGCINLNONXHY-GFCCVEGCSA-N,C1C[C@H](CNC1)NC(=O)C2=C(C=C(S2)C3=CC(=CC=C3)F)NC(=O)N,,,Haoyuan chemexpress,HY-999-20101012,362.420000,,,,,2016-04-04
10018-101-1,10018,Neratinib,HKI-272,LSM-42778,53398697,,180022,556.20,"InChI=1S/C30H29ClN6O3/c1-4-39-28-16-25-23(15-26(28)36-29(38)9-7-13-37(2)3)30(20(17-32)18-34-25)35-21-10-11-27(24(31)14-21)40-19-22-8-5-6-12-33-22/h5-12,14-16,18H,4,13,19H2,1-3H3,(H,34,35)(H,36,38)",JWNPDZNEKVCWMY-UHFFFAOYSA-N,CCOC1=C(C=C2C(=C1)N=CC(=C2NC3=CC(=C(C=C3)OCC4=CC=CC=N4)Cl)C#N)NC(=O)C=CCN(C)C,,,Haoyuan chemexpress,HM-016_11-20100622,557.040000,,,,,2018-03-30
10020-101-1,10020,Dasatinib,BMS-354825; Sprycel,LSM-1020,3062316,,1421,487.16,"InChI=1S/C22H26ClN7O2S/c1-14-4-3-5-16(23)20(14)28-21(32)17-13-24-22(33-17)27-18-12-19(26-15(2)25-18)30-8-6-29(7-9-30)10-11-31/h3-5,12-13,31H,6-11H2,1-2H3,(H,28,32)(H,24,25,26,27)",ZBNZXTGUTAYRHI-UHFFFAOYSA-N,CC1=C(C(=CC=C1)Cl)NC(=O)C2=CN=C(S2)NC3=NC(=NC(=C3)N4CCN(CC4)CCO)C,,,Haoyuan chemexpress,HY-999-20101220,488.010000,,,,,2016-04-04
10032-101-1,10032,Saracatinib,AZD0530,LSM-1032,10302451,,217092,541.21,"InChI=1S/C27H32ClN5O5/c1-32-6-8-33(9-7-32)10-13-35-19-14-21-24(23(15-19)38-18-4-11-34-12-5-18)27(30-16-29-21)31-25-20(28)2-3-22-26(25)37-17-36-22/h2-3,14-16,18H,4-13,17H2,1H3,(H,29,30,31)",OUKYUETWWIPKQR-UHFFFAOYSA-N,CN1CCN(CC1)CCOC2=CC(=C3C(=C2)N=CN=C3NC4=C(C=CC5=C4OCO5)Cl)OC6CCOCC6,,,Haoyuan chemexpress,HY-999-20100409,542.030000,,,,,2016-04-04
10047-101-1,10047,Pictilisib,Pictrelisib; GDC-0941; RG-7321,LSM-1047,17755052,,521851,513.16,"InChI=1S/C23H27N7O3S2/c1-35(31,32)30-7-5-28(6-8-30)15-16-13-20-21(34-16)23(29-9-11-33-12-10-29)26-22(25-20)17-3-2-4-19-18(17)14-24-27-19/h2-4,13-14H,5-12,15H2,1H3,(H,24,27)",LHNIIDJUOCFXAP-UHFFFAOYSA-N,CS(=O)(=O)N1CCN(CC1)CC2=CC3=C(S2)C(=NC(=N3)C4=C5C=NNC5=CC=C4)N6CCOCC6,,,Nathanael Gray (DFCI),GDC-0941-1,513.640000,,,,,2016-12-20
10071-101-1,10071,Palbociclib,PD0332991,LSM-1071,5330286,,189963,447.24,"InChI=1S/C24H29N7O2/c1-15-19-14-27-24(28-20-8-7-18(13-26-20)30-11-9-25-10-12-30)29-22(19)31(17-5-3-4-6-17)23(33)21(15)16(2)32/h7-8,13-14,17,25H,3-6,9-12H2,1-2H3,(H,26,27,28,29)",AHJRHEGDXFFMBM-UHFFFAOYSA-N,CC1=C(C(=O)N(C2=NC(=NC=C12)NC3=NC=C(C=C3)N4CCNCC4)C5CCCC5)C(=O)C,,,Haoyuan chemexpress,HM-003_TM20110113,447.530000,,,,,2016-04-04
10080-101-1,10080,Torin2,,LSM-1080,51358113,,,432.12,"InChI=1S/C24H15F3N4O/c25-24(26,27)17-2-1-3-18(11-17)31-22(32)9-6-16-13-29-20-7-4-14(10-19(20)23(16)31)15-5-8-21(28)30-12-15/h1-13H,(H2,28,30)",GUXXEUUYCAYESJ-UHFFFAOYSA-N,C1=CC(=CC(=C1)N2C(=O)C=CC3=CN=C4C=CC(=CC4=C32)C5=CN=C(C=C5)N)C(F)(F)F,,,Nathanael Gray (DFCI),Torin2-1,432.400000,,,,,2016-04-04
10102-101-4,10102,Taxol,Paclitaxel,LSM-1102,441276,,428647,853.33,"InChI=1S/C47H51NO14/c1-25-31(60-43(56)36(52)35(28-16-10-7-11-17-28)48-41(54)29-18-12-8-13-19-29)23-47(57)40(61-42(55)30-20-14-9-15-21-30)38-45(6,32(51)22-33-46(38,24-58-33)62-27(3)50)39(53)37(59-26(2)49)34(25)44(47,4)5/h7-21,31-33,35-38,40,51-52,57H,22-24H2,1-6H3,(H,48,54)/t31-,32-,33+,35-,36+,37+,38?,40-,45+,46-,47+/m0/s1",RCINICONZNJXQF-VAZQATRQSA-N,CC1=C2[C@H](C(=O)[C@@]3([C@H](C[C@@H]4[C@](C3[C@@H]([C@@](C2(C)C)(C[C@@H]1OC(=O)[C@@H]([C@H](C5=CC=CC=C5)NC(=O)C6=CC=CC=C6)O)O)OC(=O)C7=CC=CC=C7)(CO4)OC(=O)C)O)C)OC(=O)C,,,MedChem Express,14145,853.910000,,,,,2016-04-04
10131-101-1,10131,Tivantinib,ARQ197,LSM-1131,11494412,,,369.15,"InChI=1S/C23H19N3O2/c27-22-19(16-11-24-18-9-2-1-7-14(16)18)20(23(28)25-22)17-12-26-10-4-6-13-5-3-8-15(17)21(13)26/h1-3,5,7-9,11-12,19-20,24H,4,6,10H2,(H,25,27,28)/t19-,20-/m0/s1",UCEQXRCJXIVODC-PMACEKPBSA-N,C1CC2=CC=CC3=C2N(C1)C=C3[C@H]4[C@@H](C(=O)NC4=O)C5=CNC6=CC=CC=C65,,,Haoyuan chemexpress,HM-098_6-20110406,369.420000,,,,,2016-04-04
10142-101-1,10142,Trametinib,GSK-1120212; GSK1120212; GSK1120212B; JTP-74057,LSM-1143,11707110,,,615.08,"InChI=1S/C26H23FIN5O4/c1-13-22-21(23(31(3)24(13)35)30-20-10-7-15(28)11-19(20)27)25(36)33(17-8-9-17)26(37)32(22)18-6-4-5-16(12-18)29-14(2)34/h4-7,10-12,17,30H,8-9H2,1-3H3,(H,29,34)",LIRYPHYGHXZJBZ-UHFFFAOYSA-N,CC1=C2C(=C(N(C1=O)C)NC3=C(C=C(C=C3)I)F)C(=O)N(C(=O)N2C4=CC(=CC=C4)NC(=O)C)C5CC5,,,Haoyuan chemexpress,HM-078_10-20101118,615.390000,,,,,2016-05-06
10144-101-3,10144,Olaparib,AZD2281; KU-0059436,LSM-1145,23725625,,,434.18,"InChI=1S/C24H23FN4O3/c25-20-8-5-15(14-21-17-3-1-2-4-18(17)22(30)27-26-21)13-19(20)24(32)29-11-9-28(10-12-29)23(31)16-6-7-16/h1-5,8,13,16H,6-7,9-12,14H2,(H,27,30)",FDLYAMZZIXQODN-UHFFFAOYSA-N,C1CC1C(=O)N2CCN(CC2)C(=O)C3=C(C=CC(=C3)CC4=NNC(=O)C5=CC=CC=C54)F,,,MedChem Express,14425,434.460000,,,,,2016-04-04
10147-101-1,10147,Buparlisib,BKM120; NVP-BKM120,LSM-1148,16654980,,,410.17,"InChI=1S/C18H21F3N6O2/c19-18(20,21)13-9-15(22)23-11-12(13)14-10-16(26-1-5-28-6-2-26)25-17(24-14)27-3-7-29-8-4-27/h9-11H,1-8H2,(H2,22,23)",CWHUFRVAEUJCEF-UHFFFAOYSA-N,C1COCCN1C2=NC(=NC(=C2)C3=CN=C(C=C3C(F)(F)F)N)N4CCOCC4,,,Haoyuan chemexpress,HM-054_10-20100824,410.390000,,,,,2016-04-04
10161-101-1,10161,Luminespib,NVP-AUY922,LSM-1162,53401173,,,465.23,"InChI=1S/C26H31N3O5/c1-4-27-26(32)24-23(18-7-5-17(6-8-18)15-29-9-11-33-12-10-29)25(34-28-24)20-13-19(16(2)3)21(30)14-22(20)31/h5-8,13-14,16,28,30H,4,9-12,15H2,1-3H3,(H,27,32)",SWDZPNJZKUGIIH-UHFFFAOYSA-N,CCNC(=O)C1=C(C(=C2C=C(C(=CC2=O)O)C(C)C)ON1)C3=CC=C(C=C3)CN4CCOCC4,,,Haoyuan chemexpress,HY-10215_1-20091014,465.540000,,,,,2016-07-12
10171-101-1,10171,TGX221,,LSM-1172,9907093,,,364.19,"InChI=1S/C21H24N4O2/c1-15-12-18(16(2)22-17-6-4-3-5-7-17)21-23-19(13-20(26)25(21)14-15)24-8-10-27-11-9-24/h3-7,12-14,16,22H,8-11H2,1-2H3",CPRAGQJXBLMUEL-UHFFFAOYSA-N,CC1=CN2C(=O)C=C(N=C2C(=C1)C(C)NC3=CC=CC=C3)N4CCOCC4,,,Haoyuan chemexpress,HY-10114_1-20100324,364.440000,,,,,2016-04-04
10179-101-1,10179,ABT-737,,LSM-1180,11228183,,,812.26,"InChI=1S/C42H45ClN6O5S2/c1-46(2)23-22-35(30-55-37-9-4-3-5-10-37)44-40-21-20-38(28-41(40)49(51)52)56(53,54)45-42(50)32-14-18-36(19-15-32)48-26-24-47(25-27-48)29-33-8-6-7-11-39(33)31-12-16-34(43)17-13-31/h3-21,28,35,44H,22-27,29-30H2,1-2H3,(H,45,50)/t35-/m1/s1",HPLNQCPCUACXLM-PGUFJCEWSA-N,CN(C)CC[C@H](CSC1=CC=CC=C1)NC2=C(C=C(C=C2)S(=O)(=O)NC(=O)C3=CC=C(C=C3)N4CCN(CC4)CC5=CC=CC=C5C6=CC=C(C=C6)Cl)[N+](=O)[O-],,,Haoyuan chemexpress,HM-130-20110616,813.430000,,,,,2016-04-04
10194-106-1,10194,Cabozantinib,XL-184; BMS-907351,LSM-1195,25102847,,,501.17,"InChI=1S/C28H24FN3O5/c1-35-24-15-21-22(16-25(24)36-2)30-14-11-23(21)37-20-9-7-19(8-10-20)32-27(34)28(12-13-28)26(33)31-18-5-3-17(29)4-6-18/h3-11,14-16H,12-13H2,1-2H3,(H,31,33)(H,32,34)",ONIQOQHATWINJY-UHFFFAOYSA-N,COC1=CC2=C(C=CN=C2C=C1OC)OC3=CC=C(C=C3)NC(=O)C4(CC4)C(=O)NC5=CC=C(C=C5)F,,,Haoyuan chemexpress,HY-12044-20110919,635.590000,,,,,2016-04-04
10205-101-1,10205,INK-128,MLN0128,LSM-1206,45375953,,,309.13,"InChI=1S/C15H15N7O/c1-7(2)22-14-11(13(16)18-6-19-14)12(21-22)8-3-4-10-9(5-8)20-15(17)23-10/h3-7H,1-2H3,(H2,17,20)(H2,16,18,19)",GYLDXIAOMVERTK-UHFFFAOYSA-N,CC(C)N1C2=C(C(=N1)C3=CC4=C(C=C3)OC(=N4)N)C(=NC=N2)N,,,Haoyuan chemexpress,HY-13328-20120118,309.330000,,,,,2016-04-04
10233-101-1,10233,Alpelisib,BYL719,LSM-4256,56649450,,,441.14,"InChI=1S/C19H22F3N5O2S/c1-10-14(11-6-7-24-13(9-11)18(2,3)19(20,21)22)30-16(25-10)26-17(29)27-8-4-5-12(27)15(23)28/h6-7,9,12H,4-5,8H2,1-3H3,(H2,23,28)(H,25,26,29)/t12-/m0/s1",STUWGJZDJHPWGZ-LBPRGKRZSA-N,CC1=C(SC(=N1)NC(=O)N2CCC[C@H]2C(=O)N)C3=CC(=NC=C3)C(C)(C)C(F)(F)F,,,Haoyuan chemexpress,HM-206_014-20120614,441.470000,,,,,2016-07-12
10235-101-1,10235,Everolimus,RAD001,LSM-4258,53398658,,,957.58,"InChI=1S/C53H83NO14/c1-32-16-12-11-13-17-33(2)44(63-8)30-40-21-19-38(7)53(62,68-40)50(59)51(60)54-23-15-14-18-41(54)52(61)67-45(35(4)28-39-20-22-43(66-25-24-55)46(29-39)64-9)31-42(56)34(3)27-37(6)48(58)49(65-10)47(57)36(5)26-32/h11-13,16-17,27,32,34-36,38-41,43-46,48-49,55,58,62H,14-15,18-26,28-31H2,1-10H3",HKVAMNSJSFKALM-UHFFFAOYSA-N,CC1CCC2CC(C(=CC=CC=CC(CC(C(=O)C(C(C(=CC(C(=O)CC(OC(=O)C3CCCCN3C(=O)C(=O)C1(O2)O)C(C)CC4CCC(C(C4)OC)OCCO)C)C)O)OC)C)C)C)OC,,,Haoyuan chemexpress,HM-039A_5-20110929,958.220000,,,,,2016-04-04
10245-999-4,10245,Cisplatin,CDDP; cis-Diaminodichloroplatinum; Cisplatinum; Lederplatin; Briplatin; Cismaplat,LSM-4268,,,,298.96,InChI=1S/2ClH.2H3N.Pt/h2*1H;2*1H3;/q;;;;+2/p-2,LXZZYRPGZAFOLE-UHFFFAOYSA-L,N.N.[Cl-].[Cl-].[Pt+2],,,Joan Brugge (HMS),,,,,,,2018-02-09
10248-102-3,10248,Doxorubicin,Adriamycin,LSM-4062,31703,,,543.17,"InChI=1S/C27H29NO11/c1-10-22(31)13(28)6-17(38-10)39-15-8-27(36,16(30)9-29)7-12-19(15)26(35)21-20(24(12)33)23(32)11-4-3-5-14(37-2)18(11)25(21)34/h3-5,10,13,15,17,22,29,31,33,35-36H,6-9,28H2,1-2H3/t10-,13-,15-,17-,22+,27-/m0/s1",AOJJSUZBOXZQNB-TZSSRYMLSA-N,C[C@H]1[C@H]([C@H](C[C@@H](O1)O[C@H]2C[C@@](CC3=C(C4=C(C(=C23)O)C(=O)C5=C(C4=O)C=CC=C5OC)O)(C(=O)CO)O)N)O,,,MedChem Express,9909,579.980000,,,,,2016-04-04
10250-101-3,10250,Etoposide,,LSM-6348,36462,,,588.18,"InChI=1S/C29H32O13/c1-11-36-9-20-27(40-11)24(31)25(32)29(41-20)42-26-14-7-17-16(38-10-39-17)6-13(14)21(22-15(26)8-37-28(22)33)12-4-18(34-2)23(30)19(5-12)35-3/h4-7,11,15,20-22,24-27,29-32H,8-10H2,1-3H3/t11-,15+,20-,21-,22+,24-,25-,26-,27-,29+/m1/s1",VJJPUSNTGOMMGY-MRVIYFEKSA-N,C[C@@H]1OC[C@@H]2[C@@H](O1)[C@@H]([C@H]([C@@H](O2)O[C@H]3[C@H]4COC(=O)[C@@H]4[C@@H](C5=CC6=C(C=C35)OCO6)C7=CC(=C(C(=C7)OC)O)OC)O)O,,,MedChem Express,11793,588.560000,,,,,2016-04-04
10278-102-2,10278,Topotecan,Hycamtin,LSM-5662,60700,,,421.16,"InChI=1S/C23H23N3O5/c1-4-23(30)16-8-18-20-12(9-26(18)21(28)15(16)11-31-22(23)29)7-13-14(10-25(2)3)19(27)6-5-17(13)24-20/h5-8,27,30H,4,9-11H2,1-3H3/t23-/m0/s1",UCFGDBYHRUNTLO-QHCPKHFHSA-N,CC[C@@]1(C2=C(COC1=O)C(=O)N3CC4=C(C3=C2)N=C5C=CC(=C(C5=C4)CN(C)C)O)O,,,Selleck Chemicals,s123105,457.910000,,,,,2018-02-09
10282-101-2,10282,Vorinostat,suberoylanilide hydroxamic acid (SAHA); Zolinza,LSM-3828,5311,,,264.15,"InChI=1S/C14H20N2O3/c17-13(15-12-8-4-3-5-9-12)10-6-1-2-7-11-14(18)16-19/h3-5,8-9,19H,1-2,6-7,10-11H2,(H,15,17)(H,16,18)",WAEXFXRVDQXREF-UHFFFAOYSA-N,C1=CC=C(C=C1)NC(=O)CCCCCCC(=O)NO,,,Haoyuan chemexpress,HY-10221-20120320A,264.320000,,,,,2016-04-04
10287-101-2,10287,Dinaciclib,SCH727965,LSM-6306,46926350,,,396.23,"InChI=1S/C21H28N6O2/c1-2-17-14-23-27-19(22-13-16-6-5-9-25(29)15-16)12-20(24-21(17)27)26-10-4-3-7-18(26)8-11-28/h5-6,9,12,14-15,18,22,28H,2-4,7-8,10-11,13H2,1H3/t18-/m0/s1",PIMQWRZWLQKKBJ-SFHVURJKSA-N,CCC1=C2N=C(C=C(N2N=C1)NCC3=C[N+](=CC=C3)[O-])N4CCCC[C@H]4CCO,,,MedChem Express,14760,396.490000,,,,,2016-04-04
10338-101-1,10338,Ipatasertib,GDC 0068; GDC-0068; GDC0068; RG 7440; RG-7440; RG7440,LSM-6341,24788740,,,457.22,"InChI=1S/C24H32ClN5O2/c1-15(2)26-13-19(17-4-6-18(25)7-5-17)24(32)30-10-8-29(9-11-30)23-21-16(3)12-20(31)22(21)27-14-28-23/h4-7,14-16,19-20,26,31H,8-13H2,1-3H3/t16-,19-,20-/m1/s1",GRZXWCHAXNAUHY-NSISKUIASA-N,C[C@@H]1C[C@H](C2=C1C(=NC=N2)N3CCN(CC3)C(=O)[C@H](CNC(C)C)C4=CC=C(C=C4)Cl)O,,,Haoyuan chemexpress,HY-15186-20130401,458.000000,,,,,2017-05-09
10387-101-1,10387,Volasertib,BI6727,,10461508,,,618.40,"InChI=1S/C34H50N8O3/c1-6-28-33(44)39(4)29-20-35-34(38-31(29)42(28)22(2)3)37-27-14-9-24(19-30(27)45-5)32(43)36-25-10-12-26(13-11-25)41-17-15-40(16-18-41)21-23-7-8-23/h9,14,19-20,22-23,25-26,28H,6-8,10-13,15-18,21H2,1-5H3,(H,36,43)(H,35,37,38)/t25-,26-,28-/m1/s1",SXNJFOWDRLKDSF-STROYTFGSA-N,O=C(N[C@H]1CC[C@H](N2CCN(CC3CC3)CC2)CC1)C4=CC=C(NC(N=C5N(C(C)C)[C@@H]6CC)=NC=C5N(C)C6=O)C(OC)=C4,,,MedChem Express,12094,618.810000,,,,,2016-04-04
10390-103-1,10390,Abemaciclib,LY2835219,,46220502,,,506.27,"InChI=1S/C27H32F2N8/c1-5-35-8-10-36(11-9-35)16-19-6-7-24(30-14-19)33-27-31-15-22(29)25(34-27)20-12-21(28)26-23(13-20)37(17(2)3)18(4)32-26/h6-7,12-15,17H,5,8-11,16H2,1-4H3,(H,30,31,33,34)",UZWDCWONPYILKI-UHFFFAOYSA-N,CCN1CCN(CC1)CC2=CN=C(C=C2)NC3=NC=C(C(=N3)C4=CC5=C(C(=C4)F)N=C(N5C(C)C)C)F,,,MedChem Express,0'8492,602.700000,,,,,2016-04-04
10394-101-1,10394,Ceritinib,LDK378,,57379345,,,557.22,"InChI=1S/C28H36ClN5O3S/c1-17(2)37-25-15-21(20-10-12-30-13-11-20)19(5)14-24(25)33-28-31-16-22(29)27(34-28)32-23-8-6-7-9-26(23)38(35,36)18(3)4/h6-9,14-18,20,30H,10-13H2,1-5H3,(H2,31,32,33,34)",VERWOWGGCGHDQE-UHFFFAOYSA-N,CC1=CC(=C(C=C1C2CCNCC2)OC(C)C)NC3=NC=C(C(=N3)NC4=CC=CC=C4S(=O)(=O)C(C)C)Cl,,,MedChem Express,11564,558.140000,,,,,2016-04-04
10404-101-1,10404,PF-4708671,,,51371303,,,390.18,"InChI=1S/C19H21F3N6/c1-2-13-10-23-12-24-18(13)28-7-5-27(6-8-28)11-17-25-15-4-3-14(19(20,21)22)9-16(15)26-17/h3-4,9-10,12H,2,5-8,11H2,1H3,(H,25,26)",FBLPQCAQRNSVHB-UHFFFAOYSA-N,CCC1=CN=CN=C1N2CCN(CC2)CC3=NC4=C(N3)C=C(C=C4)C(F)(F)F,,,MedChem Express,10592,390.410000,,,,,2016-04-04
10444-101-1,10444,Cediranib,Recentin; AZD2171,,9933475,,,450.21,"InChI=1S/C25H27FN4O3/c1-16-12-17-19(29-16)6-7-21(24(17)26)33-25-18-13-22(31-2)23(14-20(18)27-15-28-25)32-11-5-10-30-8-3-4-9-30/h6-7,12-15,29H,3-5,8-11H2,1-2H3",XXJWYDDUDKYVKI-UHFFFAOYSA-N,CC1=CC2=C(N1)C=CC(=C2F)OC3=NC=NC4=CC(=C(C=C43)OC)OCCCN5CCCC5,,,MedChem Express,10890,450.510000,,,,,2016-04-04
10445-101-1,10445,Taselisib,GDC-0032; RG-7604,LSM-45140,51001932,,,460.23,"InChI=1S/C24H28N8O2/c1-14(2)32-22(27-15(3)29-32)19-13-30-8-9-34-20-10-16(6-7-18(20)21(30)28-19)17-11-26-31(12-17)24(4,5)23(25)33/h6-7,10-14H,8-9H2,1-5H3,(H2,25,33)",BEUQXVWXFDOSAQ-UHFFFAOYSA-N,CC1=NN(C(=N1)C2=CN3CCOC4=C(C3=N2)C=CC(=C4)C5=CN(N=C5)C(C)(C)C(=O)N)C(C)C,,,MedChem Express,10661,460.530000,,,,,2018-03-30
10478-102-1,10478,A-1210477,,,,,,849.39,"InChI=1S/C46H55N7O7S/c1-33-43(41(49(4)47-33)32-60-36-19-17-35(18-20-36)51-22-24-52(25-23-51)61(56,57)48(2)3)40-14-8-13-38-39(15-9-29-59-42-16-7-11-34-10-5-6-12-37(34)42)45(46(54)55)53(44(38)40)26-21-50-27-30-58-31-28-50/h5-8,10-14,16-20H,9,15,21-32H2,1-4H3,(H,54,55)",XMVAWGSQPHFXKU-UHFFFAOYSA-N,CN(C)S(=O)(=O)N1CCN(CC1)C1=CC=C(OCC2=C(C(C)=NN2C)C2=C3N(CCN4CCOCC4)C(C(O)=O)=C(CCCOC4=C5C=CC=CC5=CC=C4)C3=CC=C2)C=C1,,,Active Biochem,,941.190000,,,,,2016-04-04
10482-114-1,10482,Bleomycin,Blenoxane,,456190,,,1414.52,"InChI=1S/C55H83N17O21S3/c1-20-33(69-46(72-44(20)58)25(12-31(57)76)64-13-24(56)45(59)82)50(86)71-35(41(26-14-61-19-65-26)91-54-43(39(80)37(78)29(15-73)90-54)92-53-40(81)42(93-55(60)88)38(79)30(16-74)89-53)51(87)66-22(3)36(77)21(2)47(83)70-34(23(4)75)49(85)63-10-8-32-67-28(18-94-32)52-68-27(17-95-52)48(84)62-9-7-11-96(5)6/h14,17-19,21-25,29-30,34-43,53-54,64,73-75,77-81H,7-13,15-16,56H2,1-6H3,(H13-,57,58,59,60,61,62,63,65,66,69,70,71,72,76,82,83,84,85,86,87,88)/p+1/t21-,22+,23+,24-,25-,29-,30+,34-,35-,36-,37+,38+,39-,40-,41?,42-,43-,53+,54-/m0/s1",OYVAGSVQBOHSSS-QRQYLRPSSA-O,CC1=C(N=C(N=C1N)[C@H](CC(=O)N)NC[C@@H](C(=O)N)N)C(=O)N[C@@H](C(C2=CN=CN2)O[C@H]3[C@H]([C@H]([C@@H]([C@@H](O3)CO)O)O)O[C@@H]4[C@H]([C@H]([C@@H]([C@H](O4)CO)O)OC(=O)N)O)C(=O)N[C@H](C)[C@H]([C@H](C)C(=O)N[C@@H]([C@@H](C)O)C(=O)NCCC5=NC(=CS5)C6=NC(=CS6)C(=O)NCCC[S+](C)C)O,,,Selleck Chemicals,07,1512.620000,,,,,2018-02-09
