Name,HMS LINCS ID,UniProt ID,Alternative Names,Provider,Provider Catalog ID,Amino Acid Sequence,Gene Symbol,Gene ID,Protein Source,Mutation,Phosphlorylation State,Domain,Protein Description,Protein Purity,Protein Complex,Isoform,Protein Type,Source Organism,Reference,Comments,Date Publicly Available,Most Recent Update
ATR,200643,Q13535,Serine/threonine-protein kinase ATR,KiNativ,,FYIMMCkPK,,,,,,,,,,,,,,,,2016-09-14
NEK8,200771,Q86SG6,Serine/threonine-protein kinase Nek8,KiNativ,,DLkTQNILLDK,,,,,,,,,,,,,,,,2016-09-14
"ABL,ARG",200633,P00519,Proto-oncogene tyrosine-protein kinase ABL1,KiNativ,,LMTGDTYTAHAGAkFPIK,,,,,,,,,,,,,,,,2016-09-14
ACK,200635,Q07912,Activated CDC42 kinase 1,KiNativ,,TVSVAVKCLkPDVLSQPEAMDDFIR,,,,,,,,,,,,,,,,2016-09-14
AGK,200636,Q53H12,"Acylglycerol kinase, mitochondrial",KiNativ,,ATVFLNPAACkGK,,,,,,,,,,,,,,,,2016-09-14
"AMPKa1,AMPKa2",200639,Q13131,5'-AMP-activated protein kinase catalytic subunit alpha-1,KiNativ,,DLkPENVLLDAHMNAK,,,,,,,,,,,,,,,,2016-09-14
"AMPKa1,AMPKa2",200640,Q13131,5'-AMP-activated protein kinase catalytic subunit alpha-1,KiNativ,,VAVkILNR,,,,,,,,,,,,,,,,2016-09-14
ARAF,200641,P10398,A-Raf proto-oncogene serine/threonine-protein kinase,KiNativ,,DLkSNNIFLHEGLTVK,,,,,,,,,,,,,,,,2016-09-14
BRAF,200647,P15056,Serine/threonine-protein kinase B-raf; v-raf murine sarcoma viral oncogene homolog B1; BRAF1; RAFB1,KiNativ,,DLkSNNIFLHEDLTVK,,,,,,,,,,,,,,,,2016-09-14
CaMK1a,200648,Q14012,Calcium/calmodulin-dependent protein kinase I; CAMK1; CaMK1a; CAMKI; MGC120317; MGC120318,KiNativ,,LVAIkCIAK,,,,,,,,,,,,,,,,2016-09-14
CaMK2g,200650,Q13555,Calcium/calmodulin-dependent protein kinase type II gamma chain,KiNativ,,TSTQEYAAkIINTK,,,,,,,,,,,,,,,,2016-09-14
CASK,200653,O14936,Peripheral plasma membrane protein CASK,KiNativ,,ETGQQFAVkIVDVAK,,,,,,,,,,,,,,,,2016-09-14
CDK10,200655,Q15131,Cell division protein kinase 10,KiNativ,,DLkVSNLLMTDK,,,,,,,,,,,,,,,,2016-09-14
"CDK11,CDK8",200656,P49336,Cell division protein kinase 8,KiNativ,,DLkPANILVMGEGPER,,,,,,,,,,,,,,,,2016-09-14
CDK2,200658,P24941,Cyclin-dependent kinase 2; p33 protein kinase,KiNativ,,DLkPQNLLINTEGAIK,,,,,,,,,,,,,,,,2016-09-14
CDK5,200661,Q00535,Cyclin-dependent kinase 5; cell division protein kinase 5; PSSALRE,KiNativ,,NRETHEIVALkR,,,,,,,,,,,,,,,,2016-09-14
CDK7,200663,P50613,Cyclin-dependent kinase 7; cell division protein kinase 7; CAK1; CDK7; CDKN7; MO15; p39MO15; STK1,KiNativ,,DLkPNNLLLDENGVLK,,,,,,,,,,,,,,,,2016-09-14
CDK9,200664,P50750,Cyclin-dependent kinase 9; cell division protein kinase 9; C-2k; CDC2L4; CDK9; CTK1; PITALRE; TAK,KiNativ,,DMkAANVLITR,,,,,,,,,,,,,,,,2016-09-14
CHK2,200666,O96017,Serine/threonine-protein kinase Chk2; CHK2 checkpoint homolog,KiNativ,,VAIkIISK,CHEK2,11200,,,,,,,,,,Homo sapiens,,,,2016-09-14
KC1A,200667,P48729,Casein kinase I isoform alpha,KiNativ,,DIkPDNFLMGIGR,,,,,,,,,,,,,,,,2016-09-14
"CK1d,CK1e",200668,P48730,Casein kinase I isoform delta,KiNativ,,DVkPDNFLMGLGKK,,,,,,,,,,,,,,,,2016-09-14
CSK,200669,P41240,Tyrosine-protein kinase CSK,KiNativ,,VSDFGLTkEASSTQDTGKLPVK,,,,,,,,,,,,,,,,2016-09-14
DMPK,200671,Q09013,Myotonin-protein kinase; Dystrophia myotonica-protein kinase; DM; DM1; DM1PK; DMK; MDPK; MT-PK,KiNativ,,DIkPDNILLDR,DMPK,1760,,,,,,,,,,Homo sapiens,,,,2016-09-14
DNAPK,200672,P78527,DNA-dependent protein kinase catalytic subunit,KiNativ,,kGGSWIQEINVAEK,,,,,,,,,,,,,,,,2016-09-14
DNAPK,200675,P78527,DNA-dependent protein kinase catalytic subunit,KiNativ,,GHDEREHPFLVkGGEDLRQDQR,,,,,,,,,,,,,,,,2016-09-14
eEF2K,200677,O00418,Elongation factor 2 kinase,KiNativ,,YIkYNSNSGFVR,,,,,,,,,,,,,,,,2016-09-14
EGFR,200678,P00533,Epidermal growth factor receptor precursor,KiNativ,,IPVAIkELR,,,,,,,,,,,,,,,,2016-09-14
EPHA2,200679,P29317,Ephrin type-A receptor 2,KiNativ,,VLEDDPEATYTTSGGkIPIR,,,,,,,,,,,,,,,,2016-09-14
MK03,200681,P27361,Mitogen-activated protein kinase 3,KiNativ,,DLkPSNLLINTTCDLK,,,,,,,,,,,,,,,,2016-09-14
Erk5,200682,Q13164,Mitogen-activated protein kinase 7,KiNativ,,DLkPSNLLVNENCELK,,,,,,,,,,,,,,,,2016-09-14
FAK,200683,Q05397,Focal adhesion kinase 1,KiNativ,,CIGEGQFGDVHQGIYMSPENPALAVAIkTCK,,,,,,,,,,,,,,,,2016-09-14
FER,200686,P16591,Proto-oncogene tyrosine-protein kinase FER,KiNativ,,TSVAVkTCKEDLPQELK,,,,,,,,,,,,,,,,2016-09-14
"FYN,SRC,YES",200687,P06241,Proto-oncogene tyrosine-protein kinase Fyn,KiNativ,,QGAkFPIKWTAPEAALYGR,,,,,,,,,,,,,,,,2016-09-14
GCK,200689,Q12851,Mitogen-activated protein kinase kinase kinase kinase 2,KiNativ,,DTVTSELAAVkIVK,,,,,,,,,,,,,,,,2016-09-14
GCN2_domain2,200691,Q9P2K8,Eukaryotic translation initiation factor 2-alpha kinase 4,KiNativ,,DLkPVNIFLDSDDHVK,,,,,,domain2,,,,,,,,,,2016-09-14
GSK3A,200693,P49840,Glycogen synthase kinase-3 alpha,KiNativ,,DIkPQNLLVDPDTAVLK,,,,,,,,,,,,,,,,2016-09-14
GSK3B,200694,P49841,Glycogen synthase kinase-3 beta,KiNativ,,DIkPQNLLLDPDTAVLK,,,,,,,,,,,,,,,,2016-09-14
IKKA,200695,O15111,Inhibitor of nuclear factor kappa-B kinase subunit alpha,KiNativ,,DLkPENIVLQDVGGK,CHUK,,,,,,,,,,,,,,,2016-09-14
"IKKE,TBK1",200697,Q14164,Inhibitor of nuclear factor kappa-B kinase subunit epsilon,KiNativ,,DIkPGNIMR,IKBKE,9641,,,,,,,,,,Homo sapiens,,,,2016-09-14
ILK,200698,Q13418,Integrin-linked protein kinase 1,KiNativ,,ISMADVkFSFQCPGR,,,,,,,,,,,,,,,,2016-09-14
ILK,200699,Q13418,Integrin-linked protein kinase 1,KiNativ,,WQGNDIVVkVLK,,,,,,,,,,,,,,,,2016-09-14
IRAK1,200700,P51617,Interleukin-1 receptor-associated kinase 1,KiNativ,,AIQFLHQDSPSLIHGDIkSSNVLLDER,IRAK1,,,,,,,,,,,,,,,2016-09-14
IRAK4,200701,Q9NWZ3,Interleukin-1 receptor-associated kinase 4; IPD1; NY-REN-64; REN64,KiNativ,,DIkSANILLDEAFTAK,IRAK4,51135,,,,,,,,,,Homo sapiens,,,,2016-09-14
IRE1,200702,O75460,Serine/threonine-protein kinase/endoribonuclease IRE1,KiNativ,,DLkPHNILISMPNAHGK,,,,,,,,,,,,,,,,2016-09-14
JAK1,200704,P23458,Tyrosine-protein kinase JAK1,KiNativ,,QLASALSYLEDKDLVHGNVCTkNLLLAR,,,,,,,,,,,,,,,,2016-09-14
JAK1_domain2,200705,P23458,Tyrosine-protein kinase JAK1,KiNativ,,YDPEGDNTGEQVAVkSLKPESGGNHIADLKK,,,,,,domain2,,,,,,,,,,2016-09-14
JAK1_domain2,200706,P23458,Tyrosine-protein kinase JAK1,KiNativ,,IGDFGLTkAIETDKEYYTVK,,,,,,domain2,,,,,,,,,,2016-09-14
"JNK1,JNK2,JNK3",200707,P45983,Mitogen-activated protein kinase 8,KiNativ,,DLkPSNIVVK,,,,,,,,,,,,,,,,2016-09-14
KHS1,200710,Q9Y4K4,Mitogen-activated protein kinase kinase kinase kinase 5,KiNativ,,NVHTGELAAVkIIK,,,,,,,,,,,,,,,,2016-09-14
LATS1,200711,O95835,Serine/threonine-protein kinase LATS1,KiNativ,,ALYATkTLR,,,,,,,,,,,,,,,,2016-09-14
LKB1,200712,Q15831,Serine/threonine-protein kinase 11,KiNativ,,DIkPGNLLLTTGGTLK,,,,,,,,,,,,,,,,2016-09-14
LOK,200714,O94804,Serine/threonine-protein kinase 10,KiNativ,,DLkAGNVLMTLEGDIR,STK10,,,,,,,,,,,,,,,2016-09-14
LOK,200716,O94804,Serine/threonine-protein kinase 10,KiNativ,,NKETGALAAAkVIETK,STK10,,,,,,,,,,,,,,,2016-09-14
"MAP2K1,MAP2K2",200719,Q02750,Dual specificity mitogen-activated protein kinase kinase 1,KiNativ,,DVkPSNILVNSR,,,,,,,,,,,,,,,,2016-09-14
MAP2K3,200722,P46734,Dual specificity mitogen-activated protein kinase kinase 3,KiNativ,,DVkPSNVLINK,,,,,,,,,,,,,,,,2016-09-14
MAP2K4,200723,P45985,Dual specificity mitogen-activated protein kinase kinase 4,KiNativ,,MVHKPSGQIMAVkR,,,,,,,,,,,,,,,,2016-09-14
MAP2K4,200724,P45985,Dual specificity mitogen-activated protein kinase kinase 4,KiNativ,,DIkPSNILLDR,,,,,,,,,,,,,,,,2016-09-14
MAP2K6,200726,P52564,Dual specificity mitogen-activated protein kinase kinase 6,KiNativ,,DVkPSNVLINALGQVK,,,,,,,,,,,,,,,,2016-09-14
MAP2K6,200728,P52564,Dual specificity mitogen-activated protein kinase kinase 6,KiNativ,,HVPSGQIMAVkR,,,,,,,,,,,,,,,,2016-09-14
MAP3K1,200730,Q13233,Mitogen-activated protein kinase kinase kinase 1,KiNativ,,DVkGANLLIDSTGQR,,,,,,,,,,,,,,,,2016-09-14
M3K2,200731,Q9Y2U5,Mitogen-activated protein kinase kinase kinase 2; MAP3K2; MEKK2; MEKK2/MAP3K2; MEKK2B,KiNativ,,ELAVkQVQFDPDSPETSKEVNALECEIQLLK,MAP3K2,10746,,,,,,,,,,Homo sapiens,,,,2016-09-14
"M3K2,MAP3K3",200732,Q9Y2U5,Mitogen-activated protein kinase kinase kinase 2; MAP3K2; MEKK2; MEKK2/MAP3K2; MEKK2B,KiNativ,,DIkGANILR,MAP3K2,10746,,,,,,,,,,Homo sapiens,,,,2016-09-14
MAP3K4,200734,Q9Y6R4,Mitogen-activated protein kinase kinase kinase 4,KiNativ,,DIkGANIFLTSSGLIK,,,,,,,,,,,,,,,,2016-09-14
"MAP3K5,MAP3K6,MAP3K7",200735,Q99683,Mitogen-activated protein kinase kinase kinase 5,KiNativ,,IAIkEIPERDSR,,,,,,,,,,,,,,,,2016-09-14
"MARK2,MARK3",200739,P27448,MAP/microtubule affinity-regulating kinase 3,KiNativ,,DLkAENLLLDADMNIK,,,,,,,,,,,,,,,,2016-09-14
"MAST2,MAST4",200742,Q6P0Q8,Microtubule-associated serine/threonine-protein kinase 2,KiNativ,,DLkPDNLLVTSMGHIK,,,,,,,,,,,,,,,,2016-09-14
MAST3,200743,O60307,Microtubule-associated serine/threonine-protein kinase 3,KiNativ,,DLkPDNLLITSLGHIK,,,,,,,,,,,,,,,,2016-09-14
MLK3,200746,Q16584,Mitogen-activated protein kinase kinase kinase 11,KiNativ,,DLkSNNILLLQPIESDDMEHK,,,,,,,,,,,,,,,,2016-09-14
MPSK1,200748,O75716,Serine/threonine-protein kinase 16,KiNativ,,DLkPTNILLGDEGQPVLMDLGSMNQACIHVEGSR,,,,,,,,,,,,,,,,2016-09-14
"MSK1,MSK2_domain1",200749,O75582,Ribosomal protein S6 kinase alpha 5,KiNativ,,VLGTGAYGkVFLVR,,,,,,domain1,,,,,,,,,,2016-09-14
MSK1_domain1,200750,O75582,Ribosomal protein S6 kinase alpha 5,KiNativ,,DIkLENILLDSNGHVVLTDFGLSK,,,,,,domain1,,,,,,,,,,2016-09-14
MST1,200751,Q13043,Serine/threonine-protein kinase 4,KiNativ,,ETGQIVAIkQVPVESDLQEIIK,,,,,,,,,,,,,,,,2016-09-14
"MST1,MST2",200753,Q13043,Serine/threonine-protein kinase 4,KiNativ,,DIkAGNILLNTEGHAK,,,,,,,,,,,,,,,,2016-09-14
MST2,200755,Q13188,Serine/threonine-protein kinase 3,KiNativ,,ESGQVVAIkQVPVESDLQEIIK,,,,,,,,,,,,,,,,2016-09-14
MST3,200756,Q9Y6E0,Serine/threonine-protein kinase 24,KiNativ,,DIkAANVLLSEHGEVK,,,,,,,,,,,,,,,,2016-09-14
"MST4,YSK1",200759,O00506,Serine/threonine-protein kinase 25,KiNativ,,DIkAANVLLSEQGDVK,,,,,,,,,,,,,,,,2016-09-14
NDR2,200764,Q9Y2H1,Serine/threonine-protein kinase 38-like,KiNativ,,DTGHIYAMkILR,,,,,,,,,,,,,,,,2016-09-14
NEK1,200767,Q96PY6,Serine/threonine-protein kinase Nek1,KiNativ,,DIkSQNIFLTK,,,,,,,,,,,,,,,,2016-09-14
"NEK6,NEK7",200768,Q9HC98,Serine/threonine-protein kinase Nek6,KiNativ,,DIkPANVFITATGVVK,,,,,,,,,,,,,,,,2016-09-14
NEK9,200774,Q8TD19,Serine/threonine-protein kinase Nek9,KiNativ,,DIkTLNIFLTK,,,,,,,,,,,,,,,,2016-09-14
NEK9,200775,Q8TD19,Serine/threonine-protein kinase Nek9,KiNativ,,LGDYGLAkK,,,,,,,,,,,,,,,,2016-09-14
"p38d,p38g",200777,P53778,Mitogen-activated protein kinase 12,KiNativ,,DLkPGNLAVNEDCELK,,,,,,,,,,,,,,,,2016-09-14
KS6B1,200779,P23443,Ribosomal protein S6 kinase 1 (EC 2.7.1.37) (S6K) (S6K1) (70 kDa ribosomal protein S6 kinase 1) (p70 S6 kinase alpha) (p70(S6K)-alpha),KiNativ,,DLkPENIMLNHQGHVK,RPS6KB1,,,,,,,,,,,,,,,2016-09-14
"p70S6K,p70S6Kb",200780,P23443,Ribosomal protein S6 kinase 1 (EC 2.7.1.37) (S6K) (S6K1) (70 kDa ribosomal protein S6 kinase 1) (p70 S6 kinase alpha) (p70(S6K)-alpha),KiNativ,,GGYGkVFQVR,,,,,,,,,,,,,,,,2016-09-14
KS6B2,200782,Q9UBS0,Ribosomal protein S6 kinase beta-2,KiNativ,,DLkPENIMLSSQGHIK,RPS6KB2,,,,,,,,,,,,,,,2016-09-14
CDK16,200783,Q00536,Cyclin-dependent kinase 16; Cell division protein kinase 16; Serine/threonine-protein kinase PCTAIRE-1; FLJ16665; PCTAIRE; PCTAIRE1; PCTGAIRE; PCTK1,KiNativ,,LTDNLVALkEIR,CDK16,5127,,,,,,,,,,Homo sapiens,,,,2016-09-14
PCTAIRE2,200784,Q00537,Serine/threonine-protein kinase PCTAIRE-2,KiNativ,,DLkPQNLLINEK,,,,,,,,,,,,,,,,2016-09-14
CDK14,200787,O94921,Cyclin-dependent kinase 14; serine/threonine-protein kinase PFTAIRE-1; PFTK1,KiNativ,,LVALkVIR,CDK14,5218,,,,,,,,,,Homo sapiens,,,,2016-09-14
PHKg2,200788,P15735,"Phosphorylase b kinase gamma catalytic chain, testis/liver isoform",KiNativ,,ATGHEFAVkIMEVTAER,,,,,,,,,,,,,,,,2016-09-14
"PI4KA,PI4KAP2",200789,P42356,Phosphatidylinositol 4-kinase alpha,KiNativ,,SGTPMQSAAkAPYLAK,,,,,,,,,,,,,,,,2016-09-14
PI4KB,200790,Q9UBF8,Phosphatidylinositol 4-kinase beta,KiNativ,,VPHTQAVVLNSkDK,,,,,,,,,,,,,,,,2016-09-14
PIK3C3,200793,Q8NEB9,Phosphatidylinositol 3-kinase catalytic subunit type 3,KiNativ,,TEDGGKYPVIFkHGDDLR,PIK3C3,5289,,,,,,,,,,,,,,2016-09-14
PIK3CB,200795,P42338,"Phosphatidylinositol-4,5-bisphosphate 3-kinase, catalytic subunit beta; DKFZp779K1237; MGC133043; P110BETA; PI3K; PI3KBETA; PIK3C1; PIK3CB; PI3K-beta",KiNativ,,VFGEDSVGVIFkNGDDLRQDMLTLQMLR,PIK3CB,5291,,,,,,,,,,Homo sapiens,,,,2016-09-14
PI42C,200799,Q8TBX8,Phosphatidylinositol 5-phosphate 4-kinase type-2 gamma; FLJ22055; PIP4K2C; PIP5K2C,KiNativ,,TLVIkEVSSEDIADMHSNLSNYHQYIVK,PIP4K2C,79837,,,,,,,,,,Homo sapiens,,,,2016-09-14
PITSLRE,200801,P21127,PITSLRE serine/threonine-protein kinase CDC2L1,KiNativ,,DLkTSNLLLSHAGILK,,,,,,,,,,,,,,,,2016-09-14
"PKCa,PKCb",200802,P17252,Protein kinase C alpha type,KiNativ,,DLkLDNVMLDSEGHIK,,,,,,,,,,,,,,,,2016-09-14
"PKD1,PKD2",200805,Q15139,Serine/threonine-protein kinase D1,KiNativ,,NIVHCDLkPENVLLASADPFPQVK,,,,,,,,,,,,,,,,2016-09-14
PKR,200809,P19525,"Interferon-induced, double-stranded RNA-activated protein kinase",KiNativ,,DLkPSNIFLVDTK,,,,,,,,,,,,,,,,2016-09-14
PRPK,200812,Q96S44,TP53-regulating kinase,KiNativ,,FLSGLELVkQGAEAR,,,,,,,,,,,,,,,,2016-09-14
"ROCK1,ROCK2",200814,O75116,Rho-associated protein kinase 2,KiNativ,,DVkPDNMLLDK,,,,,,,,,,,,,,,,2016-09-14
"RSK1,RSK2_domain1",200816,Q15418,Ribosomal protein S6 kinase alpha 1; KS6A1,KiNativ,,DLkPENILLDEEGHIKLTDFGLSK,RPS6KA1,6195,,,,domain1,,,,,,,,,,2016-09-14
RSK2_domain1,200820,P51812,Ribosomal protein S6 kinase alpha 3; KS6A3; S6K-alpha-3; p90-RSK 3; MAPKAPK-1b; pp90RSK2,KiNativ,,LTDFGLSkESIDHEKK,RPS6KA3,6197,,,,domain1,,,,,,,,,,2016-09-14
RSK2_domain2,200821,P51812,Ribosomal protein S6 kinase alpha 3; KS6A3; S6K-alpha-3; p90-RSK 3; MAPKAPK-1b; pp90RSK2,KiNativ,,DLkPSNILYVDESGNPESIR,RPS6KA3,6197,,,,domain2,,,,,,,,,,2016-09-14
RSK2_domain2,200822,P51812,Ribosomal protein S6 kinase alpha 3; KS6A3; S6K-alpha-3; p90-RSK 3; MAPKAPK-1b; pp90RSK2,KiNativ,,SkRDPTEEIEILLR,RPS6KA3,6197,,,,domain2,,,,,,,,,,2016-09-14
RSKL1_domain1,200825,Q96S38,Ribosomal protein S6 kinase delta-1,KiNativ,,VLGVIDkVLLVMDTR,RPS6KC1,,,,,domain1,,,,,,,,,,2016-09-14
SGK3,200826,Q96BR1,Serine/threonine-protein kinase Sgk3; Serum/glucocorticoid-regulated kinase 3; CISK; DKFZp781N0293; SGKL,KiNativ,,FYAVkVLQK,SGK3,23678,,,,,,,,,,Homo sapiens,,,,2016-09-14
SLK,200829,Q9H2G2,STE20-like serine/threonine-protein kinase; CTCL tumor antigen se20-9; bA16H23.1; KIAA0204; LOSK; MGC133067; se20-9; SLK; STK2,KiNativ,,DLkAGNILFTLDGDIK,SLK,9748,,,,,,,,,,,,,,2016-09-14
SMG1,200830,Q96Q15,Serine/threonine-protein kinase SMG1,KiNativ,,DTVTIHSVGGTITILPTkTKPK,SMG1,,,,,,,,,,,Homo sapiens,,,,2016-09-14
SRC,200832,P12931,Proto-oncogene tyrosine-protein kinase Src; V-src sarcoma (Schmidt-Ruppin A-2) viral oncogene homolog (avian); ASV; c-SRC; p60-Src; SRC; SRC1,KiNativ,,VAIkTLKPGTMSPEAFLQEAQVMK,SRC,6714,,,,,,,,,,,,,,2016-09-14
STLK5,200833,Q7RTN6,STE20-related adaptor protein,KiNativ,,YSVkVLPWLSPEVLQQNLQGYDAK,,,,,,,,,,,,,,,,2016-09-14
"TAO1,TAOK3",200834,Q9H2K8,Serine/threonine-protein kinase TAO3; TAO kinase 3; DKFZp666H245; DPK; FLJ31808; JIK; MAP3K18; TAO3,KiNativ,,DIkAGNILLTEPGQVK,TAOK3,51347,,,,,,,,,,Homo sapiens,,,,2016-09-14
TAOK2,200835,Q9UL54,Serine/threonine-protein kinase TAO2; prostate-derived sterile 20-like kinase 1; hKFC-C; KIAA0881; MAP3K17; PSK; PSK1; PSK1-BETA; TAO2; TAOK2,KiNativ,,DVkAGNILLSEPGLVK,TAOK2,9344,,,,,,,,,,,,,,2016-09-14
TBK1,200836,Q9UHD2,Serine/threonine-protein kinase TBK1; TANK-binding kinase 1; NF-kappa-B-activating kinase; FLJ11330; NAK; T2K; TBK1,KiNativ,,TGDLFAIkVFNNISFLRPVDVQMR,TBK1,29110,,,,,,,,,,,,,,2016-09-14
TLK1,200837,Q9UKI8,Serine/threonine-protein kinase tousled-like 1; tousled-like kinase 1; KIAA0137; PKU-beta; TLK1,KiNativ,,YLNEIKPPIIHYDLkPGNILLVDGTACGEIK,TLK1,9874,,,,,,,,,,,,,,2016-09-14
TLK2,200838,Q86UE8,Serine/threonine-protein kinase tousled-like 2; tousled-like kinase 2; MGC44450; PKU-ALPHA; TLK2,KiNativ,,YVAVkIHQLNK,TLK2,11011,,,,,,,,,,,,,,2016-09-14
WEE1,200841,P30291,Wee1-like protein kinase; DKFZp686I18166; FLJ16446; WEE1; WEE1A; WEE1hu,KiNativ,,YIHSMSLVHMDIkPSNIFISR,WEE1,7465,,,,,,,,,,,,,,2016-09-14
"Wnk1,Wnk2,Wnk3",200842,Q9Y3S1,Serine/threonine-protein kinase WNK2,KiNativ,,DLkCDNIFITGPTGSVK,WNK2,65268,,,,,,,,,,Homo sapiens,,,,2016-09-14
"Wnk1,Wnk2,Wnk4",200843,Q9Y3S1,Serine/threonine-protein kinase WNK2,KiNativ,,IGDLGLATLkR,WNK2,65268,,,,,,,,,,Homo sapiens,,,,2016-09-14
WNK4,200844,Q96J92,Serine/threonine-protein kinase WNK4,KiNativ,,DLkCDNVFITGPTGSVK,WNK4,65266,,,,,,,,,,,,,,2016-09-14
MLTK,200845,Q9NYL2,Mitogen-activated protein kinase kinase kinase MLT; sterile alpha motif and leucine zipper containing kinase AZK; AZK; MLK7; mlklak; MLT; MLTK; MRK; pk; ZAK,KiNativ,,WISQDKEVAVKk,ZAK,51776,,,,,,,,,,,,,,2016-09-14
"ZC1/HGK,ZC2/TNIK,ZC3/MINK",200847,O95819,Mitogen-activated protein kinase kinase kinase kinase 4,KiNativ,,DIkGQNVLLTENAEVK,,,,,,,,,,,,,,,,2016-09-14
BARK1,200877,P25098,Beta-adrenergic receptor kinase 1; GRK2,KiNativ,,DLkPANILLDEHGHVR,ADRBK1,156,,,,,,,,,,Homo sapiens,,,,2016-09-14
BTK,200880,Q06187,Tyrosine-protein kinase BTK; agammaglobulinemia tyrosine kinase; AGMX1; ATK; BPK,KiNativ,,GQYDVAIkMIK,,,,,,,,,,,,,,,,2016-09-14
CAMK1D,200882,Q8IU85,Calcium/calmodulin-dependent protein kinase ID; CaM-K1; CAMK1D; CaMKID; CKLiK,KiNativ,,LFAVKCIPK,,,,,,,,,,,,,,,,2016-09-14
CDK5,200890,Q00535,Cyclin-dependent kinase 5; cell division protein kinase 5; PSSALRE,KiNativ,,DLkPQNLLINR,,,,,,,,,,,,,,,,2016-09-14
CHK1,200895,O14757,Serine/threonine-protein kinase Chk1; CHK1 checkpoint homolog,KiNativ,,DIkPENLLLDER,,,,,,,,,,,,,,,,2016-09-14
CHK2,200896,O96017,Serine/threonine-protein kinase Chk2; CHK2 checkpoint homolog,KiNativ,,DLkPENVLLSSQEEDCLIK,CHEK2,11200,,,,,,,,,,Homo sapiens,,,,2016-09-14
DGKA,200907,P23743,Diacylglycerol kinase alpha,KiNativ,,IDPVPNTHPLLVFVNPkSGGK,DGKA,,,,,,,,,,,Homo sapiens,,,,2016-09-14
EPHB4,200911,P54760,Ephrin type-B receptor 4; EPHB4; HTK; MYK1; TYRO11,KiNativ,,FLEENSSDPTYTSSLGGKIPIR,,,,,,,,,,,,,,,,2016-09-14
FES,200916,P07332,Proto-oncogene tyrosine-protein kinase Fes/Fps,KiNativ,,LRADNTLVAVkSCR,,,,,,,,,,,,,,,,2016-09-14
HPK1,200928,Q92918,Mitogen-activated protein kinase kinase kinase kinase 1,KiNativ,,DKVSGDLVALkMVK,,,,,,,,,,,,,,,,2016-09-14
IKKE,200933,Q14164,Inhibitor of nuclear factor kappa-B kinase subunit epsilon,KiNativ,,SGELVAVkVFNTTSYLRPR,IKBKE,9641,,,,,,,,,,Homo sapiens,,,,2016-09-14
"KSR1,KSR2",200937,Q8IVT5,Kinase suppressor of ras-1,KiNativ,,SkNVFYDNGK,KSR1,,,,,,,,,,,Homo sapiens,,,,2016-09-14
LATS2,200938,Q9NRM7,Serine/threonine-protein kinase LATS2,KiNativ,,VDTHALYAMKTLR,,,,,,,,,,,,,,,,2016-09-14
LYN,200940,P07948-2,Splice isoform LYN B of P07948,KiNativ,,VAVKTLKPGTMSVQAFLEEANLMK,,,,,,,,,,,,,,,,2016-09-14
M3K2,200943,Q9Y2U5,Mitogen-activated protein kinase kinase kinase 2; MAP3K2; MEKK2; MEKK2/MAP3K2; MEKK2B,KiNativ,,VYLCYDVDTGRELAVkQVQFDPDSPETSKEVNALECEIQLLK,MAP3K2,10746,,,,,,,,,,Homo sapiens,,,,2016-09-14
MAP3K5,200944,Q99683,Mitogen-activated protein kinase kinase,KiNativ,,DIKGDNVLINTYSGVLK,,,,,,,,,,,,,,,,2016-09-14
MAPKAPK3,200945,Q16644,MAP kinase-activated protein kinase 3,KiNativ,,kYAVTDDYQLSKQVLGLGVNGK,,,,,,,,,,,,,,,,2016-09-14
MARK2,200947,Q7KZI7,Serine/threonine-protein kinase MARK2; MAP/microtubule affinity-regulating kinase 2; EMK1; EMK-1; MGC99619; PAR-1; Par1b,KiNativ,,EVAVkIIDKTQLNSSSLQK,MARK2,2011,,,,,,,,,,Homo sapiens,,,,2016-09-14
"MARK3,MARK4",200949,P27448,MAP/microtubule affinity-regulating kinase 3,KiNativ,,EVAIkIIDK,,,,,,,,,,,,,,,,2016-09-14
MASTL,200950,Q96GX5,Microtubule-associated serine/threonine-protein kinase-like,KiNativ,,LYAVKVVK,,,,,,,,,,,,,,,,2016-09-14
MET,200951,P08581,Hepatocyte growth factor receptor; AUTS9; c-Met; HGFR; MET; RCCP2,KiNativ,,DMYDKEYYSVHNK,MET,4233,,,,,,,,,,,,,,2016-09-14
MRCKb,200952,Q9Y5S2,Serine/threonine-protein kinase MRCK beta,KiNativ,,NHHVHLYPWSSLDGAEGSFDIKLPETK,,,,,,,,,,,,,,,,2016-09-14
p38a,200965,Q15454,Protein-serine/threonine kinase,KiNativ,,DLKPSNLAVNEDCELK,,,,,,,,,,,,,,,,2016-09-14
MK14,200967,Q95NE7,Mitogen-activated protein kinase 14 [Pan troglodytes (Chimpanzee)],KiNativ,,QELNkTIWEVPER,,,,,,,,,,,,,,,,2016-09-14
PAN3,200969,Q58A45,PAB-dependent poly(A)-specific ribonuclease subunit 3,KiNativ,,VMDPTKILITGK,,,,,,,,,,,,,,,,2016-09-14
PEK,200973,Q9NZJ5,Eukaryotic translation initiation factor,KiNativ,,DLKPSNIFFTMDDVVK,,,,,,,,,,,,,,,,2016-09-14
PIK3CG,200978,P48736,"Phosphatidylinositol-4,5-bisphosphate 3-kinase, catalytic subunit gamma; PI3CG; PI3K; PI3Kgamma; PIK3; PIK3CG",KiNativ,,KkPLWLEFK,PIK3CG,5294,,,,,,,,,,Homo sapiens,,,,2016-09-14
PKN1,200989,Q16512,Protein kinase N1,KiNativ,,GHFGKVLLSEFRPSGELFAIK,,,,,,,,,,,,,,,,2016-09-14
PLK1,200992,P53350,Serine/threonine-protein kinase PLK1; polo-like kinase 1 (Drosophila); PLK; PLK1; STPK13,KiNativ,,DLkLGNLFLNEDLEVK,PLK1,5347,,,,,,,,,,,,,,2016-09-14
ROCK1,201002,Q13464,"Rho-associated protein kinase 1; Rho-associated, coiled-coil containing protein kinase 1; MGC131603; MGC43611; P160ROCK; PRO0435; ROCK1",KiNativ,,kLQLELNQER,ROCK1,6093,,,,,,,,,,,,,,2016-09-14
RON,201003,Q04912,Macrophage-stimulating protein receptor,KiNativ,,IQCAIKSLSR,MST1R,,,,,,,,,,,,,,,2016-09-14
SRPK1,201013,Q96SB4,SRSF protein kinase 1; SFRS protein kinase 1; Serine/arginine-rich protein-specific kinase 1; SFRSK1,KiNativ,,IIHTDIKPENILLSVNEQYIR,SRPK1,6732,,,,,,,,,,,,,,2016-09-14
SRPK1/2,201014,Q96SB4,Serine/threonine-protein kinase SRPK1,KiNativ,,FVAMKVVK,,,,,,,,,,,,,,,,2016-09-14
ULK3,201026,Q6PHR2,Serine/threonine-protein kinase ULK3; Unc-51-like kinase 3 (C. elegans); DKFZp434C131; FLJ90566; ULK3,KiNativ,,EVVAIkCVAK,ULK3,25989,,,,,,,,,,,,,,2016-09-14
EGFR,201035,P00533,Epidermal growth factor receptor precursor,KiNativ,,LLGAEEKEYHAEGGkVPIK,,,,,,,,,,,,,,,,2016-09-14
KPCI,201041,P41743,"Protein kinase C, iota; DXS1179E; MGC26534; nPKC-iota; PKCI; PRKCI",KiNativ,,IYAMkVVK,PRKCI,5584,,,,,,,,,,Homo sapiens,,,,2016-09-14
PRP4,201043,Q13523,Serine/threonine-protein kinase PRP4 homolog,KiNativ,,CNILHADIkPDNILVNESK,,,,,,,,,,,,,,,,2016-09-14
ANPb,201046,P20594,Atrial natriuretic peptide receptor B precursor,KiNativ,,GMAFLHNSIISSHGSLkSSNCVVDSR,,,,,,,,,,,,,,,,2016-09-14
"CaMK2a,CaMK2b,CaMK2d,CaMK2g",201047,Q9UQM7,Calcium/calmodulin-dependent protein kinase II alpha; CAMK2A; CAMKA; KIAA0968,KiNativ,,DLkPENLLLASK,,,,,,,,,,,,,,,,2016-09-14
CDK5,201048,Q00535,Cyclin-dependent kinase 5; cell division protein kinase 5; PSSALRE,KiNativ,,ETHEIVALkR,,,,,,,,,,,,,,,,2016-09-14
CK2a2,201049,P19784,Casein kinase II subunit alpha',KiNativ,,DVkPHNVMIDHQQK,,,,,,,,,,,,,,,,2016-09-14
EGFR,201050,P00533,Epidermal growth factor receptor precursor,KiNativ,,ITDFGLAkLLGAEEK,,,,,,,,,,,,,,,,2016-09-14
EphA1,201051,P21709,Ephrin type-A receptor 1 precursor,KiNativ,,LLDDFDGTYETQGGkIPIR,,,,,,,,,,,,,,,,2016-09-14
EPHA2,201052,P29317,Ephrin type-A receptor 2,KiNativ,,EVPVAIkTLK,,,,,,,,,,,,,,,,2016-09-14
EphA7,201053,Q15375,Ephrin type-A receptor 7,KiNativ,,VIEDDPEAVYTTTGGkIPVR,,,,,,,,,,,,,,,,2016-09-14
EPHB2,201054,P29323,Ephrin type-B receptor 2; CAPB; DRT; EK5; EPHB2; EPHT3; ERK; Hek5; MGC87492; PCBC; Tyro5,KiNativ,,FLEDDTSDPTYTSALGGkIPIR,,,,,,,,,,,,,,,,2016-09-14
GCN2,201055,Q9P2K8,Eukaryotic translation initiation factor 2-alpha kinase 4,KiNativ,,LDGCCYAVkR,,,,,,,,,,,,,,,,2016-09-14
JAK2 domain2,201056,O60674,Tyrosine-protein kinase JAK2,KiNativ,,IGDFGLTkVLPQDKEYYK,,,,,,domain2,,,,,,,,,,2016-09-14
JAK3 domain2,201057,P52333,Tyrosine-protein kinase JAK3; Janus kinase 3; JAK-3; L-JAK,KiNativ,,IADFGLAkLLPLDKDYYVVR,JAK3,3718,,,,domain2,,,,,,Homo sapiens,,,,2016-09-14
M4K3,201058,Q8IVH8,Mitogen-activated protein kinase kinase kinase kinase 3; GLK; KHS2; MAP4K3; MAPKKKK3; MEKKK3; RAB8IPL1,KiNativ,,NVNTGELAAIkVIK,MAP4K3,8491,,,,,,,,,,Homo sapiens,,,,2016-09-14
MET,201059,P08581,Hepatocyte growth factor receptor; AUTS9; c-Met; HGFR; MET; RCCP2,KiNativ,,DMYDKEYYSVHNkTGAK,MET,4233,,,,,,,,,,,,,,2016-09-14
MRCKb,201060,Q9Y5S2,Serine/threonine-protein kinase MRCK beta,KiNativ,,DIkPDNVLLDVNGHIR,,,,,,,,,,,,,,,,2016-09-14